BDBM50359088 CHEMBL1229205
SMILES: COc1cnc(nc1)-c1ccc(Cn2c(CC(C)(C)C(O)=O)c(SC(C)(C)C)c3cc(OCc4ccc(C)cn4)ccc23)cc1
InChI Key: InChIKey=XIPYFDKZPWWWGS-UHFFFAOYSA-N
Data: 8 IC50
Activity Spreadsheet -- Enzyme Inhibition Constant Data from BindingDB
Found 8 hits for monomerid = 50359088
Trg + Lig
Ki
nM
ΔG°
kcal/mole
IC50
nM
Kd
nM
EC50/IC50
nM
koff
s-1
kon
M-1s-1
pHTemp
°C
5-lipoxygenase/FLAP
(Homo sapiens (Human))
BDBM50359088
(CHEMBL1229205)
Show SMILES COc1cnc(nc1)-c1ccc(Cn2c(CC(C)(C)C(O)=O)c(SC(C)(C)C)c3cc(OCc4ccc(C)cn4)ccc23)cc1
Show InChI InChI=1S/C36H40N4O4S/c1-23-8-13-26(37-18-23)22-44-27-14-15-30-29(16-27)32(45-35(2,3)4)31(17-36(5,6)34(41)42)40(30)21-24-9-11-25(12-10-24)33-38-19-28(43-7)20-39-33/h8-16,18-20H,17,21-22H2,1-7H3,(H,41,42)
Reactome pathway
n/an/a 161n/an/an/an/an/an/a
Amira Pharmaceuticals
Curated by ChEMBL
Assay Description
Inhibition of FLAP in human whole blood assessed as inhibition of calcium ionophore A23187-induced LTB4 production preincubated for 15 mins by ELISA
J Med Chem 54: 8013-29 (2011)
Article DOI: 10.1021/jm2008369
BindingDB Entry DOI: 10.7270/Q269740W
5-lipoxygenase/FLAP
(Homo sapiens (Human))
BDBM50359088
(CHEMBL1229205)
Show SMILES COc1cnc(nc1)-c1ccc(Cn2c(CC(C)(C)C(O)=O)c(SC(C)(C)C)c3cc(OCc4ccc(C)cn4)ccc23)cc1
Show InChI InChI=1S/C36H40N4O4S/c1-23-8-13-26(37-18-23)22-44-27-14-15-30-29(16-27)32(45-35(2,3)4)31(17-36(5,6)34(41)42)40(30)21-24-9-11-25(12-10-24)33-38-19-28(43-7)20-39-33/h8-16,18-20H,17,21-22H2,1-7H3,(H,41,42)
Reactome pathway
n/an/a 0.600n/an/an/an/an/an/a
Amira Pharmaceuticals
Curated by ChEMBL
Assay Description
Inhibition of FLAP in human peripheral leukocytes assessed as inhibition of calcium ionophore A23187-induced LTB4 production after 10 mins by ELISA
J Med Chem 54: 8013-29 (2011)
Article DOI: 10.1021/jm2008369
BindingDB Entry DOI: 10.7270/Q269740W
5-lipoxygenase/FLAP
(Homo sapiens (Human))
BDBM50359088
(CHEMBL1229205)
Show SMILES COc1cnc(nc1)-c1ccc(Cn2c(CC(C)(C)C(O)=O)c(SC(C)(C)C)c3cc(OCc4ccc(C)cn4)ccc23)cc1
Show InChI InChI=1S/C36H40N4O4S/c1-23-8-13-26(37-18-23)22-44-27-14-15-30-29(16-27)32(45-35(2,3)4)31(17-36(5,6)34(41)42)40(30)21-24-9-11-25(12-10-24)33-38-19-28(43-7)20-39-33/h8-16,18-20H,17,21-22H2,1-7H3,(H,41,42)
Reactome pathway
n/an/a 81n/an/an/an/an/an/a
Amira Pharmaceuticals
Curated by ChEMBL
Assay Description
Inhibition of FLAP in human whole blood assessed as inhibition of calcium ionophore A23187-induced LTB4 production preincubated for 5 hrs by ELISA
J Med Chem 54: 8013-29 (2011)
Article DOI: 10.1021/jm2008369
BindingDB Entry DOI: 10.7270/Q269740W
Cytochrome P450 2D6
(Homo sapiens (Human))
BDBM50359088
(CHEMBL1229205)
Show SMILES COc1cnc(nc1)-c1ccc(Cn2c(CC(C)(C)C(O)=O)c(SC(C)(C)C)c3cc(OCc4ccc(C)cn4)ccc23)cc1
Show InChI InChI=1S/C36H40N4O4S/c1-23-8-13-26(37-18-23)22-44-27-14-15-30-29(16-27)32(45-35(2,3)4)31(17-36(5,6)34(41)42)40(30)21-24-9-11-25(12-10-24)33-38-19-28(43-7)20-39-33/h8-16,18-20H,17,21-22H2,1-7H3,(H,41,42)
n/an/a>50n/an/an/an/an/an/a
Amira Pharmaceuticals
Curated by ChEMBL
Assay Description
Inhibition of human CYP2D6
J Med Chem 54: 8013-29 (2011)
Article DOI: 10.1021/jm2008369
BindingDB Entry DOI: 10.7270/Q269740W
5-lipoxygenase/FLAP
(Homo sapiens (Human))
BDBM50359088
(CHEMBL1229205)
Show SMILES COc1cnc(nc1)-c1ccc(Cn2c(CC(C)(C)C(O)=O)c(SC(C)(C)C)c3cc(OCc4ccc(C)cn4)ccc23)cc1
Show InChI InChI=1S/C36H40N4O4S/c1-23-8-13-26(37-18-23)22-44-27-14-15-30-29(16-27)32(45-35(2,3)4)31(17-36(5,6)34(41)42)40(30)21-24-9-11-25(12-10-24)33-38-19-28(43-7)20-39-33/h8-16,18-20H,17,21-22H2,1-7H3,(H,41,42)
Reactome pathway
n/an/a 2n/an/an/an/an/an/a
Amira Pharmaceuticals
Curated by ChEMBL
Assay Description
Displacement of [3H]-3-[5-(pyrid-2-ylmethoxy)-3-tert-butylthio-1-benzylindol-2-yl]-2,2-dimethylpropionic acid from FLAP in human polymorphonuclear ce...
J Med Chem 54: 8013-29 (2011)
Article DOI: 10.1021/jm2008369
BindingDB Entry DOI: 10.7270/Q269740W
Cytochrome P450 3A4
(Homo sapiens (Human))
BDBM50359088
(CHEMBL1229205)
Show SMILES COc1cnc(nc1)-c1ccc(Cn2c(CC(C)(C)C(O)=O)c(SC(C)(C)C)c3cc(OCc4ccc(C)cn4)ccc23)cc1
Show InChI InChI=1S/C36H40N4O4S/c1-23-8-13-26(37-18-23)22-44-27-14-15-30-29(16-27)32(45-35(2,3)4)31(17-36(5,6)34(41)42)40(30)21-24-9-11-25(12-10-24)33-38-19-28(43-7)20-39-33/h8-16,18-20H,17,21-22H2,1-7H3,(H,41,42)
Reactome pathway
n/an/a 8.80n/an/an/an/an/an/a
Amira Pharmaceuticals
Curated by ChEMBL
Assay Description
Inhibition of human CYP3A4
J Med Chem 54: 8013-29 (2011)
Article DOI: 10.1021/jm2008369
BindingDB Entry DOI: 10.7270/Q269740W
Cytochrome P450 2C9
(Homo sapiens (Human))
BDBM50359088
(CHEMBL1229205)
Show SMILES COc1cnc(nc1)-c1ccc(Cn2c(CC(C)(C)C(O)=O)c(SC(C)(C)C)c3cc(OCc4ccc(C)cn4)ccc23)cc1
Show InChI InChI=1S/C36H40N4O4S/c1-23-8-13-26(37-18-23)22-44-27-14-15-30-29(16-27)32(45-35(2,3)4)31(17-36(5,6)34(41)42)40(30)21-24-9-11-25(12-10-24)33-38-19-28(43-7)20-39-33/h8-16,18-20H,17,21-22H2,1-7H3,(H,41,42)
Reactome pathway
n/an/a 4.5n/an/an/an/an/an/a
Amira Pharmaceuticals
Curated by ChEMBL
Assay Description
Inhibition of human CYP2C9
J Med Chem 54: 8013-29 (2011)
Article DOI: 10.1021/jm2008369
BindingDB Entry DOI: 10.7270/Q269740W
Cyclooxygenase-1 (COX-1)
(Homo sapiens (Human))
BDBM50359088
(CHEMBL1229205)
Show SMILES COc1cnc(nc1)-c1ccc(Cn2c(CC(C)(C)C(O)=O)c(SC(C)(C)C)c3cc(OCc4ccc(C)cn4)ccc23)cc1
Show InChI InChI=1S/C36H40N4O4S/c1-23-8-13-26(37-18-23)22-44-27-14-15-30-29(16-27)32(45-35(2,3)4)31(17-36(5,6)34(41)42)40(30)21-24-9-11-25(12-10-24)33-38-19-28(43-7)20-39-33/h8-16,18-20H,17,21-22H2,1-7H3,(H,41,42)
n/an/a 2.50E+4n/an/an/an/an/an/a
Amira Pharmaceuticals
Curated by ChEMBL
Assay Description
Inhibition of COX1-mediated TXB2 production in human whole blood after 30 mins by competitive enzyme immunoassay
J Med Chem 54: 8013-29 (2011)
Article DOI: 10.1021/jm2008369
BindingDB Entry DOI: 10.7270/Q269740W