BDBM50359236 CHEMBL1923626
SMILES: C[C@H]1N(C)C(=O)[C@@H](NCCOc2ccccc2CCCNC(=O)[C@@H](Cc2ccc(cc2)C(F)(F)F)NC1=O)C1CC1
InChI Key: InChIKey=UMRFQLWVRFCHER-OXTYCOSGSA-N
Data: 1 KI  1 EC50
Activity Spreadsheet -- Enzyme Inhibition Constant Data from BindingDB
Found 2 hits for monomerid = 50359236
Trg + Lig
Ki
nM
ΔG°
kcal/mole
IC50
nM
Kd
nM
EC50/IC50
nM
koff
s-1
kon
M-1s-1
pHTemp
°C
Appetite-regulating hormone
(Homo sapiens (Human))
BDBM50359236
(CHEMBL1923626)
Show SMILES C[C@H]1N(C)C(=O)[C@@H](NCCOc2ccccc2CCCNC(=O)[C@@H](Cc2ccc(cc2)C(F)(F)F)NC1=O)C1CC1 |r|
Show InChI InChI=1S/C30H37F3N4O4/c1-19-27(38)36-24(18-20-9-13-23(14-10-20)30(31,32)33)28(39)35-15-5-7-21-6-3-4-8-25(21)41-17-16-34-26(22-11-12-22)29(40)37(19)2/h3-4,6,8-10,13-14,19,22,24,26,34H,5,7,11-12,15-18H2,1-2H3,(H,35,39)(H,36,38)/t19-,24-,26+/m1/s1
7n/an/an/an/an/an/an/an/a
Tranzyme Pharma Inc.
Curated by ChEMBL
Assay Description
Displacement of [125I-His9]-ghrelin from human GRLN receptor by radioligand binding assay
J Med Chem 54: 8305-20 (2011)
Article DOI: 10.1021/jm2007062
BindingDB Entry DOI: 10.7270/Q2930TK0
Appetite-regulating hormone
(Homo sapiens (Human))
BDBM50359236
(CHEMBL1923626)
Show SMILES C[C@H]1N(C)C(=O)[C@@H](NCCOc2ccccc2CCCNC(=O)[C@@H](Cc2ccc(cc2)C(F)(F)F)NC1=O)C1CC1 |r|
Show InChI InChI=1S/C30H37F3N4O4/c1-19-27(38)36-24(18-20-9-13-23(14-10-20)30(31,32)33)28(39)35-15-5-7-21-6-3-4-8-25(21)41-17-16-34-26(22-11-12-22)29(40)37(19)2/h3-4,6,8-10,13-14,19,22,24,26,34H,5,7,11-12,15-18H2,1-2H3,(H,35,39)(H,36,38)/t19-,24-,26+/m1/s1
n/an/an/an/a 11n/an/an/an/a
Tranzyme Pharma Inc.
Curated by ChEMBL
Assay Description
Agonist activity at human GRLN receptor expressed in HEK293 cells assessed as calcium binding by Ca2+ bioluminescence aequorin assay
J Med Chem 54: 8305-20 (2011)
Article DOI: 10.1021/jm2007062
BindingDB Entry DOI: 10.7270/Q2930TK0