BDBM50359294 CHEMBL1928387
SMILES: Nc1cnccc1NC(=O)OCc1ccc(OC(=O)Cc2ccccc2)cc1
InChI Key: InChIKey=XWRKSVOQSFYXME-UHFFFAOYSA-N
Data: 1 KI  2 IC50
Activity Spreadsheet -- Enzyme Inhibition Constant Data from BindingDB
Found 3 hits for monomerid = 50359294
Trg + Lig
Ki
nM
ΔG°
kcal/mole
IC50
nM
Kd
nM
EC50/IC50
nM
koff
s-1
kon
M-1s-1
pHTemp
°C
Butyrylcholinesterase (BChE)
(Equus caballus (Horse))
BDBM50359294
(CHEMBL1928387)
Show SMILES Nc1cnccc1NC(=O)OCc1ccc(OC(=O)Cc2ccccc2)cc1
Show InChI InChI=1S/C21H19N3O4/c22-18-13-23-11-10-19(18)24-21(26)27-14-16-6-8-17(9-7-16)28-20(25)12-15-4-2-1-3-5-15/h1-11,13H,12,14,22H2,(H,23,24,26)
3.07E+4n/an/an/an/an/an/an/an/a
The Scripps Research Institute
Curated by ChEMBL
Assay Description
Inhibition of equine serum BChE using butyrylthiocholine iodide as a substrate by spectrophotometric Ellman's assay
Bioorg Med Chem 19: 6203-9 (2011)
Article DOI: 10.1016/j.bmc.2011.09.019
BindingDB Entry DOI: 10.7270/Q25B02XJ
Butyrylcholinesterase (BChE)
(Equus caballus (Horse))
BDBM50359294
(CHEMBL1928387)
Show SMILES Nc1cnccc1NC(=O)OCc1ccc(OC(=O)Cc2ccccc2)cc1
Show InChI InChI=1S/C21H19N3O4/c22-18-13-23-11-10-19(18)24-21(26)27-14-16-6-8-17(9-7-16)28-20(25)12-15-4-2-1-3-5-15/h1-11,13H,12,14,22H2,(H,23,24,26)
n/an/a 3.22E+4n/an/an/an/an/an/a
The Scripps Research Institute
Curated by ChEMBL
Assay Description
Inhibition of equine serum BChE using butyrylthiocholine iodide as a substrate by spectrophotometric Ellman's assay
Bioorg Med Chem 19: 6203-9 (2011)
Article DOI: 10.1016/j.bmc.2011.09.019
BindingDB Entry DOI: 10.7270/Q25B02XJ
Acetylcholinesterase
(Electrophorus electricus (Electric eel))
BDBM50359294
(CHEMBL1928387)
Show SMILES Nc1cnccc1NC(=O)OCc1ccc(OC(=O)Cc2ccccc2)cc1
Show InChI InChI=1S/C21H19N3O4/c22-18-13-23-11-10-19(18)24-21(26)27-14-16-6-8-17(9-7-16)28-20(25)12-15-4-2-1-3-5-15/h1-11,13H,12,14,22H2,(H,23,24,26)
n/an/a 1.36E+5n/an/an/an/an/an/a
The Scripps Research Institute
Curated by ChEMBL
Assay Description
Inhibition of Electrophorus electricus Type V-S acetylcholinesterase using acetylcholine iodide as substrate by spectrophotometric Ellman's assay
Bioorg Med Chem 19: 6203-9 (2011)
Article DOI: 10.1016/j.bmc.2011.09.019
BindingDB Entry DOI: 10.7270/Q25B02XJ