BDBM50359399 CHEMBL106808
SMILES: CCOC(=O)Nc1nc(NC(C)CCCN(CC)CC)c2nc(-c3ccccc3)c(nc2n1)-c1ccccc1
InChI Key: InChIKey=IDKNHJPIGDKZNA-UHFFFAOYSA-N
Data: 1 IC50
Activity Spreadsheet -- Enzyme Inhibition Constant Data from BindingDB
Found 1 hit for monomerid = 50359399
Trg + Lig
Ki
nM
ΔG°
kcal/mole
IC50
nM
Kd
nM
EC50/IC50
nM
koff
s-1
kon
M-1s-1
pHTemp
°C
Cell division protein FtsZ
(Mycobacterium tuberculosis)
BDBM50359399
(CHEMBL106808)
Show SMILES CCOC(=O)Nc1nc(NC(C)CCCN(CC)CC)c2nc(-c3ccccc3)c(nc2n1)-c1ccccc1
Show InChI InChI=1S/C30H37N7O2/c1-5-37(6-2)20-14-15-21(4)31-27-26-28(35-29(34-27)36-30(38)39-7-3)33-25(23-18-12-9-13-19-23)24(32-26)22-16-10-8-11-17-22/h8-13,16-19,21H,5-7,14-15,20H2,1-4H3,(H2,31,33,34,35,36,38)
n/an/a 3.81E+4n/an/an/an/an/an/a
Southern Research Institute
Curated by ChEMBL
Assay Description
Inhibition of Mycobacterium tuberculosis FtsZ polymerization expressed in Escherichia coli by light scattering assay
Bioorg Med Chem 19: 7120-8 (2011)
Article DOI: 10.1016/j.bmc.2011.09.062
BindingDB Entry DOI: 10.7270/Q2VX0GZ1