BDBM50360079 CHEMBL1928720
SMILES: CN(\N=C\c1cnn2ccc(cc12)C#N)S(=O)(=O)c1cc(Br)ccc1C
InChI Key: InChIKey=JUYJIYYFWNFOJF-KEBDBYFISA-N
Data: 3 IC50
Activity Spreadsheet -- Enzyme Inhibition Constant Data from BindingDB
Found 3 hits for monomerid = 50360079
Trg + Lig
Ki
nM
ΔG°
kcal/mole
IC50
nM
Kd
nM
EC50/IC50
nM
koff
s-1
kon
M-1s-1
pHTemp
°C
Phosphatidylinositol 4,5-bisphosphate 3-kinase catalytic subunit alpha isoform
(Homo sapiens (Human))
BDBM50360079
(CHEMBL1928720)
Show SMILES CN(\N=C\c1cnn2ccc(cc12)C#N)S(=O)(=O)c1cc(Br)ccc1C
Show InChI InChI=1S/C17H14BrN5O2S/c1-12-3-4-15(18)8-17(12)26(24,25)22(2)20-10-14-11-21-23-6-5-13(9-19)7-16(14)23/h3-8,10-11H,1-2H3/b20-10+
NCI pathway
Reactome pathway
n/an/a 13n/an/an/an/an/an/a
University of Auckland
Curated by ChEMBL
Assay Description
Inhibition of recombinant PI3K p110alpha using L-alpha-phosphotidylinositol as substrate and [gamma33P]ATP after 60 mins by thin layer chromatographi...
Bioorg Med Chem 20: 58-68 (2011)
Article DOI: 10.1016/j.bmc.2011.11.031
BindingDB Entry DOI: 10.7270/Q21C1X99
Phosphatidylinositol 4,5-bisphosphate 3-kinase catalytic subunit delta isoform
(Homo sapiens (Human))
BDBM50360079
(CHEMBL1928720)
Show SMILES CN(\N=C\c1cnn2ccc(cc12)C#N)S(=O)(=O)c1cc(Br)ccc1C
Show InChI InChI=1S/C17H14BrN5O2S/c1-12-3-4-15(18)8-17(12)26(24,25)22(2)20-10-14-11-21-23-6-5-13(9-19)7-16(14)23/h3-8,10-11H,1-2H3/b20-10+
NCI pathway
Reactome pathway
n/an/a 180n/an/an/an/an/an/a
University of Auckland
Curated by ChEMBL
Assay Description
Inhibition of recombinant PI3K p110delta using L-alpha-phosphotidylinositol as substrate and [gamma33P]ATP after 60 mins by thin layer chromatographi...
Bioorg Med Chem 20: 58-68 (2011)
Article DOI: 10.1016/j.bmc.2011.11.031
BindingDB Entry DOI: 10.7270/Q21C1X99
Phosphatidylinositol 4,5-bisphosphate 3-kinase catalytic subunit beta isoform
(Homo sapiens (Human))
BDBM50360079
(CHEMBL1928720)
Show SMILES CN(\N=C\c1cnn2ccc(cc12)C#N)S(=O)(=O)c1cc(Br)ccc1C
Show InChI InChI=1S/C17H14BrN5O2S/c1-12-3-4-15(18)8-17(12)26(24,25)22(2)20-10-14-11-21-23-6-5-13(9-19)7-16(14)23/h3-8,10-11H,1-2H3/b20-10+
NCI pathway
Reactome pathway
n/an/a 620n/an/an/an/an/an/a
University of Auckland
Curated by ChEMBL
Assay Description
Inhibition of recombinant PI3K p110beta using L-alpha-phosphotidylinositol as substrate and [gamma33P]ATP after 60 mins by thin layer chromatographic...
Bioorg Med Chem 20: 58-68 (2011)
Article DOI: 10.1016/j.bmc.2011.11.031
BindingDB Entry DOI: 10.7270/Q21C1X99