BDBM50360237 CHEMBL1928213
SMILES: CN(C)CCCNc1nc(NCCc2ccccc2)nc(NCCc2ccccc2)n1
InChI Key: InChIKey=YDBALLPQKBNCPS-UHFFFAOYSA-N
Data: 1 IC50
Activity Spreadsheet -- Enzyme Inhibition Constant Data from BindingDB
Found 1 hit for monomerid = 50360237
Trg + Lig
Ki
nM
ΔG°
kcal/mole
IC50
nM
Kd
nM
EC50/IC50
nM
koff
s-1
kon
M-1s-1
pHTemp
°C
Vanilloid receptor
(Rattus norvegicus (rat))
BDBM50360237
(CHEMBL1928213)
Show SMILES CN(C)CCCNc1nc(NCCc2ccccc2)nc(NCCc2ccccc2)n1
Show InChI InChI=1S/C24H33N7/c1-31(2)19-9-16-25-22-28-23(26-17-14-20-10-5-3-6-11-20)30-24(29-22)27-18-15-21-12-7-4-8-13-21/h3-8,10-13H,9,14-19H2,1-2H3,(H3,25,26,27,28,29,30)
Reactome pathway
n/an/a 670n/an/an/an/an/an/a
Institut de Qu£mica Avan£ada de Catalunya
Curated by ChEMBL
Assay Description
Antagonist activity at rat TRPV1 expressed in Xenopus laevis oocytes assessed as blockage of capsaicin-induced current at holding potential -60 mV by...
J Med Chem 54: 7441-52 (2011)
Article DOI: 10.1021/jm200981s
BindingDB Entry DOI: 10.7270/Q2M32W6F