BDBM50360240 CHEMBL1928216
SMILES: CN(C)CCCNc1nc(NCCc2ccc(cc2)[N+]([O-])=O)nc(NCCc2ccc(cc2)[N+]([O-])=O)n1
InChI Key: InChIKey=XJQCPLPOXZGDEB-UHFFFAOYSA-N
Data: 1 IC50
Activity Spreadsheet -- Enzyme Inhibition Constant Data from BindingDB
Found 1 hit for monomerid = 50360240
Trg + Lig
Ki
nM
ΔG°
kcal/mole
IC50
nM
Kd
nM
EC50/IC50
nM
koff
s-1
kon
M-1s-1
pHTemp
°C
Vanilloid receptor
(Rattus norvegicus (rat))
BDBM50360240
(CHEMBL1928216)
Show SMILES CN(C)CCCNc1nc(NCCc2ccc(cc2)[N+]([O-])=O)nc(NCCc2ccc(cc2)[N+]([O-])=O)n1
Show InChI InChI=1S/C24H31N9O4/c1-31(2)17-3-14-25-22-28-23(26-15-12-18-4-8-20(9-5-18)32(34)35)30-24(29-22)27-16-13-19-6-10-21(11-7-19)33(36)37/h4-11H,3,12-17H2,1-2H3,(H3,25,26,27,28,29,30)
Reactome pathway
n/an/a 1.63E+3n/an/an/an/an/an/a
Institut de Qu£mica Avan£ada de Catalunya
Curated by ChEMBL
Assay Description
Antagonist activity at rat TRPV1 expressed in Xenopus laevis oocytes assessed as blockage of capsaicin-induced current at holding potential -60 mV by...
J Med Chem 54: 7441-52 (2011)
Article DOI: 10.1021/jm200981s
BindingDB Entry DOI: 10.7270/Q2M32W6F