BDBM50360247 CHEMBL1928341
SMILES: CN(C)CCCNc1nc(NCc2ccc(Cl)cc2Cl)nc(NCc2ccc(Cl)cc2Cl)n1
InChI Key: InChIKey=SRSGYLCJGXDIJZ-UHFFFAOYSA-N
Data: 1 IC50
Activity Spreadsheet -- Enzyme Inhibition Constant Data from BindingDB
Found 1 hit for monomerid = 50360247
Trg + Lig
Ki
nM
ΔG°
kcal/mole
IC50
nM
Kd
nM
EC50/IC50
nM
koff
s-1
kon
M-1s-1
pHTemp
°C
Vanilloid receptor
(Rattus norvegicus (rat))
BDBM50360247
(CHEMBL1928341)
Show SMILES CN(C)CCCNc1nc(NCc2ccc(Cl)cc2Cl)nc(NCc2ccc(Cl)cc2Cl)n1
Show InChI InChI=1S/C22H25Cl4N7/c1-33(2)9-3-8-27-20-30-21(28-12-14-4-6-16(23)10-18(14)25)32-22(31-20)29-13-15-5-7-17(24)11-19(15)26/h4-7,10-11H,3,8-9,12-13H2,1-2H3,(H3,27,28,29,30,31,32)
Reactome pathway
n/an/a 840n/an/an/an/an/an/a
Institut de Qu£mica Avan£ada de Catalunya
Curated by ChEMBL
Assay Description
Antagonist activity at rat TRPV1 expressed in Xenopus laevis oocytes assessed as blockage of capsaicin-induced current at holding potential -60 mV by...
J Med Chem 54: 7441-52 (2011)
Article DOI: 10.1021/jm200981s
BindingDB Entry DOI: 10.7270/Q2M32W6F