BDBM50360257 CHEMBL1928202
SMILES: CN(C)CCCCCNc1nc(NCCc2ccc(F)cc2)nc(NCCc2ccc(F)cc2)n1
InChI Key: InChIKey=RCDIYNLTUXFQRC-UHFFFAOYSA-N
Data: 1 IC50
Activity Spreadsheet -- Enzyme Inhibition Constant Data from BindingDB
Found 1 hit for monomerid = 50360257
Trg + Lig
Ki
nM
ΔG°
kcal/mole
IC50
nM
Kd
nM
EC50/IC50
nM
koff
s-1
kon
M-1s-1
pHTemp
°C
Vanilloid receptor
(Rattus norvegicus (rat))
BDBM50360257
(CHEMBL1928202)
Show SMILES CN(C)CCCCCNc1nc(NCCc2ccc(F)cc2)nc(NCCc2ccc(F)cc2)n1
Show InChI InChI=1S/C26H35F2N7/c1-35(2)19-5-3-4-16-29-24-32-25(30-17-14-20-6-10-22(27)11-7-20)34-26(33-24)31-18-15-21-8-12-23(28)13-9-21/h6-13H,3-5,14-19H2,1-2H3,(H3,29,30,31,32,33,34)
Reactome pathway
n/an/a 100n/an/an/an/an/an/a
Institut de Qu£mica Avan£ada de Catalunya
Curated by ChEMBL
Assay Description
Antagonist activity at rat TRPV1 expressed in Xenopus laevis oocytes assessed as blockage of capsaicin-induced current at holding potential -60 mV by...
J Med Chem 54: 7441-52 (2011)
Article DOI: 10.1021/jm200981s
BindingDB Entry DOI: 10.7270/Q2M32W6F