BDBM50360393 CHEMBL1933882
SMILES: N#C\C(=C/c1ccc(s1)-c1cccs1)c1nc2ccccc2[nH]1
InChI Key: InChIKey=IAQAYKRJOOBBTO-ZRDIBKRKSA-N
Data: 8 IC50
Activity Spreadsheet -- Enzyme Inhibition Constant Data from BindingDB
Found 8 hits for monomerid = 50360393
Trg + Lig
Ki
nM
ΔG°
kcal/mole
IC50
nM
Kd
nM
EC50/IC50
nM
koff
s-1
kon
M-1s-1
pHTemp
°C
Matrix metalloproteinase-9
(Homo sapiens (Human))
BDBM50360393
(CHEMBL1933882)
Show SMILES N#C\C(=C/c1ccc(s1)-c1cccs1)c1nc2ccccc2[nH]1
Show InChI InChI=1S/C18H11N3S2/c19-11-12(18-20-14-4-1-2-5-15(14)21-18)10-13-7-8-17(23-13)16-6-3-9-22-16/h1-10H,(H,20,21)/b12-10+
Reactome pathway
n/an/a>1.00E+5n/an/an/an/an/an/a
Microbiotix, Inc.
Curated by ChEMBL
Assay Description
Inhibition of human MMP9
Bioorg Med Chem 19: 7338-48 (2011)
Article DOI: 10.1016/j.bmc.2011.10.062
BindingDB Entry DOI: 10.7270/Q2FF3SS3
Botulinum neurotoxin type A
(Clostridium botulinum)
BDBM50360393
(CHEMBL1933882)
Show SMILES N#C\C(=C/c1ccc(s1)-c1cccs1)c1nc2ccccc2[nH]1
Show InChI InChI=1S/C18H11N3S2/c19-11-12(18-20-14-4-1-2-5-15(14)21-18)10-13-7-8-17(23-13)16-6-3-9-22-16/h1-10H,(H,20,21)/b12-10+
NCI pathway
Reactome pathway
n/an/a 1.70E+4n/an/an/an/an/an/a
Microbiotix, Inc.
Curated by ChEMBL
Assay Description
Inhibition of Clostridium botulinum BoNT/A light chain-mediated SNAP-25 substrate cleavage preincubated for 90 mins by FRET assay
Bioorg Med Chem 19: 7338-48 (2011)
Article DOI: 10.1016/j.bmc.2011.10.062
BindingDB Entry DOI: 10.7270/Q2FF3SS3
Botulinum neurotoxin type A
(Clostridium botulinum)
BDBM50360393
(CHEMBL1933882)
Show SMILES N#C\C(=C/c1ccc(s1)-c1cccs1)c1nc2ccccc2[nH]1
Show InChI InChI=1S/C18H11N3S2/c19-11-12(18-20-14-4-1-2-5-15(14)21-18)10-13-7-8-17(23-13)16-6-3-9-22-16/h1-10H,(H,20,21)/b12-10+
NCI pathway
Reactome pathway
n/an/a 2.90E+4n/an/an/an/an/an/a
Microbiotix, Inc.
Curated by ChEMBL
Assay Description
Inhibition of Clostridium botulinum BoNT/A light chain after 40 mins by HPLC assay
Bioorg Med Chem 19: 7338-48 (2011)
Article DOI: 10.1016/j.bmc.2011.10.062
BindingDB Entry DOI: 10.7270/Q2FF3SS3
Antrax lethal toxin
(Bacillus anthracis)
BDBM50360393
(CHEMBL1933882)
Show SMILES N#C\C(=C/c1ccc(s1)-c1cccs1)c1nc2ccccc2[nH]1
Show InChI InChI=1S/C18H11N3S2/c19-11-12(18-20-14-4-1-2-5-15(14)21-18)10-13-7-8-17(23-13)16-6-3-9-22-16/h1-10H,(H,20,21)/b12-10+
NCI pathway
Reactome pathway
n/an/a>1.00E+5n/an/an/an/an/an/a
Microbiotix, Inc.
Curated by ChEMBL
Assay Description
Inhibition of Bacillus anthracis lethal factor using MCA-KKVYPYPME[dnp]Kamide peptide substrate after 30 mins by FRET assay
Bioorg Med Chem 19: 7338-48 (2011)
Article DOI: 10.1016/j.bmc.2011.10.062
BindingDB Entry DOI: 10.7270/Q2FF3SS3
Interstitial collagenase
(Homo sapiens (Human))
BDBM50360393
(CHEMBL1933882)
Show SMILES N#C\C(=C/c1ccc(s1)-c1cccs1)c1nc2ccccc2[nH]1
Show InChI InChI=1S/C18H11N3S2/c19-11-12(18-20-14-4-1-2-5-15(14)21-18)10-13-7-8-17(23-13)16-6-3-9-22-16/h1-10H,(H,20,21)/b12-10+
Reactome pathway
n/an/a>1.00E+5n/an/an/an/an/an/a
Microbiotix, Inc.
Curated by ChEMBL
Assay Description
Inhibition of human MMP1
Bioorg Med Chem 19: 7338-48 (2011)
Article DOI: 10.1016/j.bmc.2011.10.062
BindingDB Entry DOI: 10.7270/Q2FF3SS3
72 kDa type IV collagenase
(Homo sapiens (Human))
BDBM50360393
(CHEMBL1933882)
Show SMILES N#C\C(=C/c1ccc(s1)-c1cccs1)c1nc2ccccc2[nH]1
Show InChI InChI=1S/C18H11N3S2/c19-11-12(18-20-14-4-1-2-5-15(14)21-18)10-13-7-8-17(23-13)16-6-3-9-22-16/h1-10H,(H,20,21)/b12-10+
Reactome pathway
n/an/a>1.00E+5n/an/an/an/an/an/a
Microbiotix, Inc.
Curated by ChEMBL
Assay Description
Inhibition of human MMP2
Bioorg Med Chem 19: 7338-48 (2011)
Article DOI: 10.1016/j.bmc.2011.10.062
BindingDB Entry DOI: 10.7270/Q2FF3SS3
Botulinum neurotoxin type A
(Clostridium botulinum)
BDBM50360393
(CHEMBL1933882)
Show SMILES N#C\C(=C/c1ccc(s1)-c1cccs1)c1nc2ccccc2[nH]1
Show InChI InChI=1S/C18H11N3S2/c19-11-12(18-20-14-4-1-2-5-15(14)21-18)10-13-7-8-17(23-13)16-6-3-9-22-16/h1-10H,(H,20,21)/b12-10+
NCI pathway
Reactome pathway
n/an/a 2.60E+4n/an/an/an/an/an/a
Microbiotix, Inc.
Curated by ChEMBL
Assay Description
Inhibition of Clostridium botulinum BoNT/A light chain-mediated SNAP-25 substrate cleavage after 40 mins by FRET assay
Bioorg Med Chem 19: 7338-48 (2011)
Article DOI: 10.1016/j.bmc.2011.10.062
BindingDB Entry DOI: 10.7270/Q2FF3SS3
Botulinum neurotoxin type B
(Clostridium botulinum)
BDBM50360393
(CHEMBL1933882)
Show SMILES N#C\C(=C/c1ccc(s1)-c1cccs1)c1nc2ccccc2[nH]1
Show InChI InChI=1S/C18H11N3S2/c19-11-12(18-20-14-4-1-2-5-15(14)21-18)10-13-7-8-17(23-13)16-6-3-9-22-16/h1-10H,(H,20,21)/b12-10+
Reactome pathway
n/an/a>1.00E+5n/an/an/an/an/an/a
Microbiotix, Inc.
Curated by ChEMBL
Assay Description
Inhibition of Clostridium botulinum BoNT/B light chain after 40 mins by FRET-based assay
Bioorg Med Chem 19: 7338-48 (2011)
Article DOI: 10.1016/j.bmc.2011.10.062
BindingDB Entry DOI: 10.7270/Q2FF3SS3