null
SMILES: CC(C)NCc1ccc(cc1)C#Cc1c(C)ncnc1Nc1ccc(OCc2cccc(F)c2)c(Cl)c1
InChI Key: InChIKey=WWVSQNVNUAFENV-UHFFFAOYSA-N
Activity Spreadsheet -- Enzyme Inhibition Constant Data from BindingDB
Found 2 hits for monomerid = 50360457
Trg + Lig
Ki
nM
ΔG°
kcal/mole
IC50
nM
Kd
nM
EC50/IC50
nM
koff
s-1
kon
M-1s-1
pHTemp
°C
Receptor tyrosine-protein kinase erbB-2
(Homo sapiens (Human))
BDBM50360457
(CHEMBL1934623)
Show SMILES CC(C)NCc1ccc(cc1)C#Cc1c(C)ncnc1Nc1ccc(OCc2cccc(F)c2)c(Cl)c1
Show InChI InChI=1S/C30H28ClFN4O/c1-20(2)33-17-23-9-7-22(8-10-23)11-13-27-21(3)34-19-35-30(27)36-26-12-14-29(28(31)16-26)37-18-24-5-4-6-25(32)15-24/h4-10,12,14-16,19-20,33H,17-18H2,1-3H3,(H,34,35,36)
n/an/a 18n/an/an/an/an/an/a
Shionogi& Co., Ltd
Curated by ChEMBL
Assay Description
Inhibition of Her-2 by time-resolved fluorescence assay
Bioorg Med Chem Lett 22: 456-60 (2011)
Article DOI: 10.1016/j.bmcl.2011.10.103
BindingDB Entry DOI: 10.7270/Q2NV9JP4
Epidermal growth factor receptor
(Homo sapiens (Human))
BDBM50360457
(CHEMBL1934623)
Show SMILES CC(C)NCc1ccc(cc1)C#Cc1c(C)ncnc1Nc1ccc(OCc2cccc(F)c2)c(Cl)c1
Show InChI InChI=1S/C30H28ClFN4O/c1-20(2)33-17-23-9-7-22(8-10-23)11-13-27-21(3)34-19-35-30(27)36-26-12-14-29(28(31)16-26)37-18-24-5-4-6-25(32)15-24/h4-10,12,14-16,19-20,33H,17-18H2,1-3H3,(H,34,35,36)
n/an/a 3n/an/an/an/an/an/a
Shionogi& Co., Ltd
Curated by ChEMBL
Assay Description
Inhibition of EGFR phosphorylation in EGF-stimulated human A431 after 2 hrs by Western blot analysis
Bioorg Med Chem Lett 22: 456-60 (2011)
Article DOI: 10.1016/j.bmcl.2011.10.103
BindingDB Entry DOI: 10.7270/Q2NV9JP4