BDBM50360471 CHEMBL1934747
SMILES: CC#C[C@]1(O)CC[C@H]2[C@@H]3CCC4=CC(=O)CCC4=C3C(=C[C@]12C)c1ccc(cc1)N(C)C
InChI Key: InChIKey=JEYQTZLASRZWLG-COTPGQAASA-N
Data: 1 IC50
Activity Spreadsheet -- Enzyme Inhibition Constant Data from BindingDB
Found 1 hit for monomerid = 50360471
Trg + Lig
Ki
nM
ΔG°
kcal/mole
IC50
nM
Kd
nM
EC50/IC50
nM
koff
s-1
kon
M-1s-1
pHTemp
°C
Progesterone receptor
(Homo sapiens (Human))
BDBM50360471
(CHEMBL1934747)
Show SMILES CC#C[C@]1(O)CC[C@H]2[C@@H]3CCC4=CC(=O)CCC4=C3C(=C[C@]12C)c1ccc(cc1)N(C)C |r,c:18,21,t:11|
Show InChI InChI=1S/C29H33NO2/c1-5-15-29(32)16-14-26-24-12-8-20-17-22(31)11-13-23(20)27(24)25(18-28(26,29)2)19-6-9-21(10-7-19)30(3)4/h6-7,9-10,17-18,24,26,32H,8,11-14,16H2,1-4H3/t24-,26-,28-,29-/m0/s1
n/an/a 307n/an/an/an/an/an/a
Pfizer Inc.
Curated by ChEMBL
Assay Description
Antagonist activity at progesterone receptor
Bioorg Med Chem Lett 22: 723-8 (2011)
Article DOI: 10.1016/j.bmcl.2011.10.066
BindingDB Entry DOI: 10.7270/Q2J67HCF