BDBM50360567 CHEMBL1933175
SMILES: FC(F)(F)c1ccc(cc1)C(=O)Nc1cc(ccn1)-c1cc2c([nH]1)C1(CCNCC1)CNC2=O
InChI Key: InChIKey=ADSKPKMUCXKPLL-UHFFFAOYSA-N
Data: 2 EC50
Activity Spreadsheet -- Enzyme Inhibition Constant Data from BindingDB
Found 2 hits for monomerid = 50360567
Trg + Lig
Ki
nM
ΔG°
kcal/mole
IC50
nM
Kd
nM
EC50/IC50
nM
koff
s-1
kon
M-1s-1
pHTemp
°C
MAP kinase-activated protein kinase 2
(Homo sapiens (Human))
BDBM50360567
(CHEMBL1933175)
Show SMILES FC(F)(F)c1ccc(cc1)C(=O)Nc1cc(ccn1)-c1cc2c([nH]1)C1(CCNCC1)CNC2=O
Show InChI InChI=1S/C24H22F3N5O2/c25-24(26,27)16-3-1-14(2-4-16)21(33)32-19-11-15(5-8-29-19)18-12-17-20(31-18)23(13-30-22(17)34)6-9-28-10-7-23/h1-5,8,11-12,28,31H,6-7,9-10,13H2,(H,30,34)(H,29,32,33)
NCI pathway
Reactome pathway
n/an/an/an/a 1.60n/an/an/an/a
Merck Research Laboratories
Curated by ChEMBL
Assay Description
Inhibition of MK2 using Fluo-betaA-11A NeoMPS as substrate pre-incubated for 30 mins before substrate addition measured after 2 hrs by IMAP assay
Bioorg Med Chem Lett 22: 613-8 (2011)
Article DOI: 10.1016/j.bmcl.2011.10.071
BindingDB Entry DOI: 10.7270/Q2RN389G
MAP kinase-activated protein kinase 2
(Homo sapiens (Human))
BDBM50360567
(CHEMBL1933175)
Show SMILES FC(F)(F)c1ccc(cc1)C(=O)Nc1cc(ccn1)-c1cc2c([nH]1)C1(CCNCC1)CNC2=O
Show InChI InChI=1S/C24H22F3N5O2/c25-24(26,27)16-3-1-14(2-4-16)21(33)32-19-11-15(5-8-29-19)18-12-17-20(31-18)23(13-30-22(17)34)6-9-28-10-7-23/h1-5,8,11-12,28,31H,6-7,9-10,13H2,(H,30,34)(H,29,32,33)
NCI pathway
Reactome pathway
n/an/an/an/a 1.30E+3n/an/an/an/a
Merck Research Laboratories
Curated by ChEMBL
Assay Description
Inhibition of MK2-mediated HSP27 phosphorylation in LPS-stimulated human THP1 cells pre-incubated for 60 mins prior to LPS-induction measured after 6...
Bioorg Med Chem Lett 22: 613-8 (2011)
Article DOI: 10.1016/j.bmcl.2011.10.071
BindingDB Entry DOI: 10.7270/Q2RN389G