BDBM50360614 CHEMBL1933543
SMILES: Cc1ccc(cn1)N1CC[C@@]2(C1)CN(C(=O)c1cc3cc(F)ccc3[nH]1)c1ccccc21
InChI Key: InChIKey=HFQQCQMPMIYINM-AREMUKBSSA-N
Data: 1 IC50
Activity Spreadsheet -- Enzyme Inhibition Constant Data from BindingDB
Found 1 hit for monomerid = 50360614
Trg + Lig
Ki
nM
ΔG°
kcal/mole
IC50
nM
Kd
nM
EC50/IC50
nM
koff
s-1
kon
M-1s-1
pHTemp
°C
Syk protein
(Mus musculus)
BDBM50360614
(CHEMBL1933543)
Show SMILES Cc1ccc(cn1)N1CC[C@@]2(C1)CN(C(=O)c1cc3cc(F)ccc3[nH]1)c1ccccc21 |r|
Show InChI InChI=1S/C26H23FN4O/c1-17-6-8-20(14-28-17)30-11-10-26(15-30)16-31(24-5-3-2-4-21(24)26)25(32)23-13-18-12-19(27)7-9-22(18)29-23/h2-9,12-14,29H,10-11,15-16H2,1H3/t26-/m1/s1
n/an/a 3.78E+4n/an/an/an/an/an/a
Pfizer Inc.
Curated by ChEMBL
Assay Description
Inhibition of mouse Sky kinase assessed as inhibition of src substrate phosphorylation by ELISA
Bioorg Med Chem Lett 22: 190-3 (2011)
Article DOI: 10.1016/j.bmcl.2011.11.036
BindingDB Entry DOI: 10.7270/Q2CF9QJS