BDBM50360956 CHEMBL1935304
SMILES: CC(C)[C@H](NS(=O)(=O)c1ccc2c(c1)oc1ccc(cc21)-c1noc(n1)C1CCOC1)C(O)=O
InChI Key: InChIKey=XIOASTZOHFEMRW-LGTGAQBVSA-N
Data: 1 IC50
Activity Spreadsheet -- Enzyme Inhibition Constant Data from BindingDB
Found 1 hit for monomerid = 50360956
Trg + Lig
Ki
nM
ΔG°
kcal/mole
IC50
nM
Kd
nM
EC50/IC50
nM
koff
s-1
kon
M-1s-1
pHTemp
°C
Matrix metalloproteinase-12 (MMP12)
(Homo sapiens (Human))
BDBM50360956
(CHEMBL1935304)
Show SMILES CC(C)[C@H](NS(=O)(=O)c1ccc2c(c1)oc1ccc(cc21)-c1noc(n1)C1CCOC1)C(O)=O |r|
Show InChI InChI=1S/C23H23N3O7S/c1-12(2)20(23(27)28)26-34(29,30)15-4-5-16-17-9-13(3-6-18(17)32-19(16)10-15)21-24-22(33-25-21)14-7-8-31-11-14/h3-6,9-10,12,14,20,26H,7-8,11H2,1-2H3,(H,27,28)/t14?,20-/m0/s1
Reactome pathway
n/an/a 0.300n/an/an/an/an/an/a
Pfizer Inc.
Curated by ChEMBL
Assay Description
Inhibition of human MMP-12
Bioorg Med Chem Lett 22: 138-43 (2011)
Article DOI: 10.1016/j.bmcl.2011.11.046
BindingDB Entry DOI: 10.7270/Q2SJ1M20