BDBM50360963 CHEMBL1935284
SMILES: CC(C)[C@H](NS(=O)(=O)c1ccc2c(c1)oc1ccc(cc21)-c1ccoc1)C(O)=O
InChI Key: InChIKey=JYGJKRYSCVUTOS-FQEVSTJZSA-N
Data: 1 IC50
Activity Spreadsheet -- Enzyme Inhibition Constant Data from BindingDB
Found 1 hit for monomerid = 50360963
Trg + Lig
Ki
nM
ΔG°
kcal/mole
IC50
nM
Kd
nM
EC50/IC50
nM
koff
s-1
kon
M-1s-1
pHTemp
°C
Matrix metalloproteinase-12 (MMP12)
(Homo sapiens (Human))
BDBM50360963
(CHEMBL1935284)
Show SMILES CC(C)[C@H](NS(=O)(=O)c1ccc2c(c1)oc1ccc(cc21)-c1ccoc1)C(O)=O |r|
Show InChI InChI=1S/C21H19NO6S/c1-12(2)20(21(23)24)22-29(25,26)15-4-5-16-17-9-13(14-7-8-27-11-14)3-6-18(17)28-19(16)10-15/h3-12,20,22H,1-2H3,(H,23,24)/t20-/m0/s1
Reactome pathway
n/an/a 0.400n/an/an/an/an/an/a
Pfizer Inc.
Curated by ChEMBL
Assay Description
Inhibition of human MMP-12
Bioorg Med Chem Lett 22: 138-43 (2011)
Article DOI: 10.1016/j.bmcl.2011.11.046
BindingDB Entry DOI: 10.7270/Q2SJ1M20