BDBM50360968 CHEMBL1935290
SMILES: CC(C)[C@H](NS(=O)(=O)c1ccc2c(c1)oc1ccc(cc21)-c1ccc[nH]1)C(O)=O
InChI Key: InChIKey=URNSMGRITRSYDT-FQEVSTJZSA-N
Data: 1 IC50
Activity Spreadsheet -- Enzyme Inhibition Constant Data from BindingDB
Found 1 hit for monomerid = 50360968
Trg + Lig
Ki
nM
ΔG°
kcal/mole
IC50
nM
Kd
nM
EC50/IC50
nM
koff
s-1
kon
M-1s-1
pHTemp
°C
Matrix metalloproteinase-12 (MMP12)
(Homo sapiens (Human))
BDBM50360968
(CHEMBL1935290)
Show SMILES CC(C)[C@H](NS(=O)(=O)c1ccc2c(c1)oc1ccc(cc21)-c1ccc[nH]1)C(O)=O |r|
Show InChI InChI=1S/C21H20N2O5S/c1-12(2)20(21(24)25)23-29(26,27)14-6-7-15-16-10-13(17-4-3-9-22-17)5-8-18(16)28-19(15)11-14/h3-12,20,22-23H,1-2H3,(H,24,25)/t20-/m0/s1
Reactome pathway
n/an/a 0.400n/an/an/an/an/an/a
Pfizer Inc.
Curated by ChEMBL
Assay Description
Inhibition of human MMP-12
Bioorg Med Chem Lett 22: 138-43 (2011)
Article DOI: 10.1016/j.bmcl.2011.11.046
BindingDB Entry DOI: 10.7270/Q2SJ1M20