BDBM50361432 CHEMBL1934396
SMILES: O=[#6]-1-[#8]-[#6]-c2cc(ccc-12)-c1ccc(\[#6]=[#6]-2/[#6](=O)-[#7]-[#6](=O)-[#7]-[#6]-2=O)s1
InChI Key: InChIKey=LYFBDLCSBGNRFM-UHFFFAOYSA-N
Data: 1 IC50
Activity Spreadsheet -- Enzyme Inhibition Constant Data from BindingDB
Found 1 hit for monomerid = 50361432
Trg + Lig
Ki
nM
ΔG°
kcal/mole
IC50
nM
Kd
nM
EC50/IC50
nM
koff
s-1
kon
M-1s-1
pHTemp
°C
Perforin-1
(Homo sapiens (Human))
BDBM50361432
(CHEMBL1934396)
Show SMILES O=[#6]-1-[#8]-[#6]-c2cc(ccc-12)-c1ccc(\[#6]=[#6]-2/[#6](=O)-[#7]-[#6](=O)-[#7]-[#6]-2=O)s1 |w:13.15|
Show InChI InChI=1S/C17H10N2O5S/c20-14-12(15(21)19-17(23)18-14)6-10-2-4-13(25-10)8-1-3-11-9(5-8)7-24-16(11)22/h1-6H,7H2,(H2,18,19,20,21,23)
NCI pathway
n/an/a 800n/an/an/an/an/an/a
University of Auckland
Curated by ChEMBL
Assay Description
Inhibition of recombinant perforin-mediated lysis of Jurkat cells assessed as [51Cr] release preincubated with perforin for 30 mins followed by incub...
Bioorg Med Chem 20: 1319-36 (2012)
Article DOI: 10.1016/j.bmc.2011.12.011
BindingDB Entry DOI: 10.7270/Q29C6XW9