BDBM50361568 CHEMBL1939320
SMILES: CNC(=O)c1cccc(F)c1Nc1nc(Nc2ccc3c(NC(=O)C(CC3(C)C)NC(=O)C(F)(F)F)c2)ncc1Cl
InChI Key: InChIKey=GGJPKPHOWZDYAP-UHFFFAOYSA-N
Data: 3 IC50
Activity Spreadsheet -- Enzyme Inhibition Constant Data from BindingDB
Found 3 hits for monomerid = 50361568
Trg + Lig
Ki
nM
ΔG°
kcal/mole
IC50
nM
Kd
nM
EC50/IC50
nM
koff
s-1
kon
M-1s-1
pHTemp
°C
Insulin receptor
(Homo sapiens (Human))
BDBM50361568
(CHEMBL1939320)
Show SMILES CNC(=O)c1cccc(F)c1Nc1nc(Nc2ccc3c(NC(=O)C(CC3(C)C)NC(=O)C(F)(F)F)c2)ncc1Cl
Show InChI InChI=1S/C26H24ClF4N7O3/c1-25(2)10-18(36-23(41)26(29,30)31)22(40)35-17-9-12(7-8-14(17)25)34-24-33-11-15(27)20(38-24)37-19-13(21(39)32-3)5-4-6-16(19)28/h4-9,11,18H,10H2,1-3H3,(H,32,39)(H,35,40)(H,36,41)(H2,33,34,37,38)
n/an/a 473n/an/an/an/an/an/a
Cephalon, Inc.
Curated by ChEMBL
Assay Description
Inhibition of insulin receptor after 20 mins by time-resolved fluorescence assay
Bioorg Med Chem 19: 6274-84 (2011)
Article DOI: 10.1016/j.bmc.2011.09.006
BindingDB Entry DOI: 10.7270/Q24M950J
Hepatocyte growth factor receptor
(Homo sapiens (Human))
BDBM50361568
(CHEMBL1939320)
Show SMILES CNC(=O)c1cccc(F)c1Nc1nc(Nc2ccc3c(NC(=O)C(CC3(C)C)NC(=O)C(F)(F)F)c2)ncc1Cl
Show InChI InChI=1S/C26H24ClF4N7O3/c1-25(2)10-18(36-23(41)26(29,30)31)22(40)35-17-9-12(7-8-14(17)25)34-24-33-11-15(27)20(38-24)37-19-13(21(39)32-3)5-4-6-16(19)28/h4-9,11,18H,10H2,1-3H3,(H,32,39)(H,35,40)(H,36,41)(H2,33,34,37,38)
n/an/a 16n/an/an/an/an/an/a
Cephalon, Inc.
Curated by ChEMBL
Assay Description
Inhibition of c-Met phosphorylation in human GTL16 cells after 2 hrs by immunoassay
Bioorg Med Chem 19: 6274-84 (2011)
Article DOI: 10.1016/j.bmc.2011.09.006
BindingDB Entry DOI: 10.7270/Q24M950J
Hepatocyte growth factor receptor
(Homo sapiens (Human))
BDBM50361568
(CHEMBL1939320)
Show SMILES CNC(=O)c1cccc(F)c1Nc1nc(Nc2ccc3c(NC(=O)C(CC3(C)C)NC(=O)C(F)(F)F)c2)ncc1Cl
Show InChI InChI=1S/C26H24ClF4N7O3/c1-25(2)10-18(36-23(41)26(29,30)31)22(40)35-17-9-12(7-8-14(17)25)34-24-33-11-15(27)20(38-24)37-19-13(21(39)32-3)5-4-6-16(19)28/h4-9,11,18H,10H2,1-3H3,(H,32,39)(H,35,40)(H,36,41)(H2,33,34,37,38)
n/an/a 13n/an/an/an/an/an/a
Cephalon, Inc.
Curated by ChEMBL
Assay Description
Inhibition of GST-tagged c-Met expressed in baculovirus system using phospholipase C-gamma as substrate after 30 mins by time-resolved fluorescence a...
Bioorg Med Chem 19: 6274-84 (2011)
Article DOI: 10.1016/j.bmc.2011.09.006
BindingDB Entry DOI: 10.7270/Q24M950J