BDBM50361682 CHEMBL1940925
SMILES: CCNC(=O)c1noc(c1NC(C)=O)-c1cc(C(C)C)c(O)cc1O
InChI Key: InChIKey=KBNLPGKGXMPKID-UHFFFAOYSA-N
Data: 1 IC50
Activity Spreadsheet -- Enzyme Inhibition Constant Data from BindingDB
Found 1 hit for monomerid = 50361682
Trg + Lig
Ki
nM
ΔG°
kcal/mole
IC50
nM
Kd
nM
EC50/IC50
nM
koff
s-1
kon
M-1s-1
pHTemp
°C
Heat shock protein HSP 90-beta
(Homo sapiens (Human))
BDBM50361682
(CHEMBL1940925)
Show SMILES CCNC(=O)c1noc(c1NC(C)=O)-c1cc(C(C)C)c(O)cc1O
Show InChI InChI=1S/C17H21N3O5/c1-5-18-17(24)15-14(19-9(4)21)16(25-20-15)11-6-10(8(2)3)12(22)7-13(11)23/h6-8,22-23H,5H2,1-4H3,(H,18,24)(H,19,21)
Reactome pathway
n/an/a 55n/an/an/an/an/an/a
Universit£ degli Studi di Ferrara
Curated by ChEMBL
Assay Description
Binding affinity to Hsp90 after 4 hrs by fluorescence polarization assay
J Med Chem 54: 8592-604 (2011)
Article DOI: 10.1021/jm201155e
BindingDB Entry DOI: 10.7270/Q2QF8T9M