BDBM50361703 CHEMBL1941052
SMILES: CCNC(=O)c1noc(c1NC(=O)c1ccc(OC)cc1)-c1cc(C(C)C)c(O)cc1O
InChI Key: InChIKey=BYAGRVGRUDLLDR-UHFFFAOYSA-N
Data: 2 IC50
Activity Spreadsheet -- Enzyme Inhibition Constant Data from BindingDB
Found 2 hits for monomerid = 50361703
Trg + Lig
Ki
nM
ΔG°
kcal/mole
IC50
nM
Kd
nM
EC50/IC50
nM
koff
s-1
kon
M-1s-1
pHTemp
°C
Heat shock protein 75 kDa, mitochondrial
(Homo sapiens (Human))
BDBM50361703
(CHEMBL1941052)
Show SMILES CCNC(=O)c1noc(c1NC(=O)c1ccc(OC)cc1)-c1cc(C(C)C)c(O)cc1O
Show InChI InChI=1S/C23H25N3O6/c1-5-24-23(30)20-19(25-22(29)13-6-8-14(31-4)9-7-13)21(32-26-20)16-10-15(12(2)3)17(27)11-18(16)28/h6-12,27-28H,5H2,1-4H3,(H,24,30)(H,25,29)
n/an/a 400n/an/an/an/an/an/a
University of Ferrara
Curated by ChEMBL
Assay Description
Inhibition of recombinant human N-terminal His6-tagged TRAP1 (60 to 704 residues) ATPase activity expressed in Escherichia coli BL21-CodonPlus-RIL af...
Bioorg Med Chem Lett 28: 2289-2293 (2018)
Article DOI: 10.1016/j.bmcl.2018.05.031
BindingDB Entry DOI: 10.7270/Q2028V14
Heat shock protein HSP 90-beta
(Homo sapiens (Human))
BDBM50361703
(CHEMBL1941052)
Show SMILES CCNC(=O)c1noc(c1NC(=O)c1ccc(OC)cc1)-c1cc(C(C)C)c(O)cc1O
Show InChI InChI=1S/C23H25N3O6/c1-5-24-23(30)20-19(25-22(29)13-6-8-14(31-4)9-7-13)21(32-26-20)16-10-15(12(2)3)17(27)11-18(16)28/h6-12,27-28H,5H2,1-4H3,(H,24,30)(H,25,29)
Reactome pathway
n/an/a 26n/an/an/an/an/an/a
Universit£ degli Studi di Ferrara
Curated by ChEMBL
Assay Description
Binding affinity to Hsp90 after 4 hrs by fluorescence polarization assay
J Med Chem 54: 8592-604 (2011)
Article DOI: 10.1021/jm201155e
BindingDB Entry DOI: 10.7270/Q2QF8T9M