BDBM50361783 CHEMBL1938519
SMILES: FC(F)(F)C(NC(=O)CCN1CCC(CC1)c1ccccc1)c1ccc(Cl)cc1
InChI Key: InChIKey=HCBGHLFVHFXNAF-UHFFFAOYSA-N
Data: 3 IC50
Activity Spreadsheet -- Enzyme Inhibition Constant Data from BindingDB
Found 3 hits for monomerid = 50361783
Trg + Lig
Ki
nM
ΔG°
kcal/mole
IC50
nM
Kd
nM
EC50/IC50
nM
koff
s-1
kon
M-1s-1
pHTemp
°C
Prolylcarboxypeptidase (PRCP)
(Homo sapiens (Human))
BDBM50361783
(CHEMBL1938519)
Show SMILES FC(F)(F)C(NC(=O)CCN1CCC(CC1)c1ccccc1)c1ccc(Cl)cc1
Show InChI InChI=1S/C22H24ClF3N2O/c23-19-8-6-18(7-9-19)21(22(24,25)26)27-20(29)12-15-28-13-10-17(11-14-28)16-4-2-1-3-5-16/h1-9,17,21H,10-15H2,(H,27,29)
Reactome pathway
n/an/a 1.40n/an/an/an/an/an/a
Merck Research Laboratories
Curated by ChEMBL
Assay Description
Inhibition of recombinant human PrCP using Mca-Ala-Pro-Lys(Dnp)-OH as substrate measured for 30 mins by continuous fluorometric assay
Bioorg Med Chem Lett 22: 658-65 (2011)
Article DOI: 10.1016/j.bmcl.2011.10.060
BindingDB Entry DOI: 10.7270/Q2B56K50
Lysosomal Pro-X carboxypeptidase
(Mus musculus)
BDBM50361783
(CHEMBL1938519)
Show SMILES FC(F)(F)C(NC(=O)CCN1CCC(CC1)c1ccccc1)c1ccc(Cl)cc1
Show InChI InChI=1S/C22H24ClF3N2O/c23-19-8-6-18(7-9-19)21(22(24,25)26)27-20(29)12-15-28-13-10-17(11-14-28)16-4-2-1-3-5-16/h1-9,17,21H,10-15H2,(H,27,29)
Reactome pathway
n/an/a 14n/an/an/an/an/an/a
Merck Research Laboratories
Curated by ChEMBL
Assay Description
Inhibition of recombinant mouse PrCP using Mca-Ala-Pro-Lys(Dnp)-OH as substrate measured for 30 mins by continuous fluorometric assay
Bioorg Med Chem Lett 22: 658-65 (2011)
Article DOI: 10.1016/j.bmcl.2011.10.060
BindingDB Entry DOI: 10.7270/Q2B56K50
Prolylcarboxypeptidase (PRCP)
(Homo sapiens (Human))
BDBM50361783
(CHEMBL1938519)
Show SMILES FC(F)(F)C(NC(=O)CCN1CCC(CC1)c1ccccc1)c1ccc(Cl)cc1
Show InChI InChI=1S/C22H24ClF3N2O/c23-19-8-6-18(7-9-19)21(22(24,25)26)27-20(29)12-15-28-13-10-17(11-14-28)16-4-2-1-3-5-16/h1-9,17,21H,10-15H2,(H,27,29)
Reactome pathway
n/an/a 70n/an/an/an/an/an/a
Merck Research Laboratories
Curated by ChEMBL
Assay Description
Inhibition of recombinant human PrCP using Mca-Ala-Pro-Lys(Dnp)-OH as substrate measured for 30 mins by continuous fluorometric assay
Bioorg Med Chem Lett 22: 658-65 (2011)
Article DOI: 10.1016/j.bmcl.2011.10.060
BindingDB Entry DOI: 10.7270/Q2B56K50