BDBM50361875 CHEMBL1938779
SMILES: NC(=O)c1ccc2cc3C(=O)NCCCn3c2c1
InChI Key: InChIKey=UUKWKSJYJTXOOA-UHFFFAOYSA-N
Data: 1 IC50
Activity Spreadsheet -- Enzyme Inhibition Constant Data from BindingDB
Found 1 hit for monomerid = 50361875
Trg + Lig
Ki
nM
ΔG°
kcal/mole
IC50
nM
Kd
nM
EC50/IC50
nM
koff
s-1
kon
M-1s-1
pHTemp
°C
Ribosomal protein S6 kinase alpha-3
(Homo sapiens (Human))
BDBM50361875
(CHEMBL1938779)
Show SMILES NC(=O)c1ccc2cc3C(=O)NCCCn3c2c1
Show InChI InChI=1S/C13H13N3O2/c14-12(17)9-3-2-8-6-11-13(18)15-4-1-5-16(11)10(8)7-9/h2-3,6-7H,1,4-5H2,(H2,14,17)(H,15,18)
Reactome pathway
n/an/a 9.10E+3n/an/an/an/an/an/a
Boehringer-Ingelheim Pharmaceuticals, Inc.
Curated by ChEMBL
Assay Description
Inhibition of RSK2 phosphorylation by luminescence assay
Bioorg Med Chem Lett 22: 733-7 (2011)
Article DOI: 10.1016/j.bmcl.2011.10.030
BindingDB Entry DOI: 10.7270/Q2XW4K7N