BDBM50361943 CHEMBL1939366
SMILES: c1cncc(c1)-c1nsc(n1)-c1cccnc1
InChI Key: InChIKey=PJSNUISYDHNJTG-UHFFFAOYSA-N
Data: 2 IC50
Activity Spreadsheet -- Enzyme Inhibition Constant Data from BindingDB
Found 2 hits for monomerid = 50361943
Trg + Lig
Ki
nM
ΔG°
kcal/mole
IC50
nM
Kd
nM
EC50/IC50
nM
koff
s-1
kon
M-1s-1
pHTemp
°C
Cytochrome P450 19A1
(Homo sapiens (Human))
BDBM50361943
(CHEMBL1939366)
Show SMILES c1cncc(c1)-c1nsc(n1)-c1cccnc1
Show InChI InChI=1S/C12H8N4S/c1-3-9(7-13-5-1)11-15-12(17-16-11)10-4-2-6-14-8-10/h1-8H
Reactome pathway
n/an/a 240n/an/an/an/an/an/a
Istanbul Medipol University
Curated by ChEMBL
Assay Description
Inhibition of aromatase (unknown origin)
Bioorg Med Chem 26: 1986-1995 (2018)
Article DOI: 10.1016/j.bmc.2018.02.048
BindingDB Entry DOI: 10.7270/Q20867Z3
Cytochrome P450 19A1
(Homo sapiens (Human))
BDBM50361943
(CHEMBL1939366)
Show SMILES c1cncc(c1)-c1nsc(n1)-c1cccnc1
Show InChI InChI=1S/C12H8N4S/c1-3-9(7-13-5-1)11-15-12(17-16-11)10-4-2-6-14-8-10/h1-8H
Reactome pathway
n/an/a 200n/an/an/an/an/an/a
Purdue University
Curated by ChEMBL
Assay Description
Inhibition of human aromatase using dibenzylfluorescein as substrate preincubated for 30 mins measured after 2 hrs by fluorimetry
Bioorg Med Chem 20: 510-20 (2011)
Article DOI: 10.1016/j.bmc.2011.09.031
BindingDB Entry DOI: 10.7270/Q2X067GF