BDBM50362093 CHEMBL1940496
SMILES: NC(COCc1ccccc1)c1csc(NC(=O)Nc2ccc(Cl)c(F)c2)n1
InChI Key: InChIKey=AQOXDXFZRWFYFH-UHFFFAOYSA-N
Data: 1 Kd
Activity Spreadsheet -- Enzyme Inhibition Constant Data from BindingDB
Found 1 hit for monomerid = 50362093
Trg + Lig
Ki
nM
ΔG°
kcal/mole
IC50
nM
Kd
nM
EC50/IC50
nM
koff
s-1
kon
M-1s-1
pHTemp
°C
Mitogen-activated protein kinase 14
(Homo sapiens (Human))
BDBM50362093
(CHEMBL1940496)
Show SMILES NC(COCc1ccccc1)c1csc(NC(=O)Nc2ccc(Cl)c(F)c2)n1
Show InChI InChI=1S/C19H18ClFN4O2S/c20-14-7-6-13(8-15(14)21)23-18(26)25-19-24-17(11-28-19)16(22)10-27-9-12-4-2-1-3-5-12/h1-8,11,16H,9-10,22H2,(H2,23,24,25,26)
NCI pathway
Reactome pathway
n/an/an/a 1.34E+4n/an/an/an/an/a
Chemical Genomics Centre of the Max Planck Society
Curated by ChEMBL
Assay Description
Binding affinity to N-terminus His-tagged human p38alpha expressed in Escherichia coli BL21 DE3 after 5 hrs by fluorescence analysis
Eur J Med Chem 48: 1-15 (2012)
Article DOI: 10.1016/j.ejmech.2011.11.019
BindingDB Entry DOI: 10.7270/Q2W096CH