null
SMILES: Nc1nc2Sc3cccc(OCCCCOc4cc(c(Cl)cc4Cl)-c(c2)n1)c3
InChI Key: InChIKey=FLKKRILCGIEOOD-UHFFFAOYSA-N
Activity Spreadsheet -- Enzyme Inhibition Constant Data from BindingDB
Found 1 hit for monomerid = 50362232
Trg + Lig
Ki
nM
ΔG°
kcal/mole
IC50
nM
Kd
nM
EC50/IC50
nM
koff
s-1
kon
M-1s-1
pHTemp
°C
Heat shock protein HSP 90-alpha
(Homo sapiens (Human))
BDBM50362232
(CHEMBL1939373)
Show SMILES Nc1nc2Sc3cccc(OCCCCOc4cc(c(Cl)cc4Cl)-c(c2)n1)c3
Show InChI InChI=1S/C20H17Cl2N3O2S/c21-15-10-16(22)18-9-14(15)17-11-19(25-20(23)24-17)28-13-5-3-4-12(8-13)26-6-1-2-7-27-18/h3-5,8-11H,1-2,6-7H2,(H2,23,24,25)
NCI pathway
Reactome pathway
n/an/an/a 11n/an/an/an/an/a
Chugai Pharmaceutical Co., Ltd
Curated by ChEMBL
Assay Description
Binding affinity to N-terminus biotinylated human Hsp90 alpha by surface plasmon resonance assay
Bioorg Med Chem Lett 22: 1136-41 (2012)
Article DOI: 10.1016/j.bmcl.2011.11.100
BindingDB Entry DOI: 10.7270/Q2KH0NS7