null
SMILES: CN1CC[C@H](NC(=O)C[C@H]2N(C=CNC2=O)S(=O)(=O)c2cc(C)c(Cl)cc2C)C(C)(C)C1
InChI Key: InChIKey=TVGQBSPGDDYQQI-MJGOQNOKSA-N
Activity Spreadsheet -- Enzyme Inhibition Constant Data from BindingDB
Found 1 hit for monomerid = 50362325
Trg + Lig
Ki
nM
ΔG°
kcal/mole
IC50
nM
Kd
nM
EC50/IC50
nM
koff
s-1
kon
M-1s-1
pHTemp
°C
B1 bradykinin receptor
(Homo sapiens (Human))
BDBM50362325
(CHEMBL1939943)
Show SMILES CN1CC[C@H](NC(=O)C[C@H]2N(C=CNC2=O)S(=O)(=O)c2cc(C)c(Cl)cc2C)C(C)(C)C1 |r,c:11|
Show InChI InChI=1S/C22H31ClN4O4S/c1-14-11-18(15(2)10-16(14)23)32(30,31)27-9-7-24-21(29)17(27)12-20(28)25-19-6-8-26(5)13-22(19,3)4/h7,9-11,17,19H,6,8,12-13H2,1-5H3,(H,24,29)(H,25,28)/t17-,19+/m1/s1
n/an/a 0.280n/an/an/an/an/an/a
Amgen, Inc.
Curated by ChEMBL
Assay Description
Antagonist activity at human bradykinin B1 receptor expressed in CHO-D-/aequorin cells assessed as inhibition of DAK-induced intracellular calcium le...
Bioorg Med Chem Lett 22: 1061-7 (2012)
Article DOI: 10.1016/j.bmcl.2011.11.112
BindingDB Entry DOI: 10.7270/Q22J6CB2