null
SMILES: Clc1cnc(nc1)N1CCN(CC1)C(=O)CCNS(=O)(=O)c1cccc2nsnc12
InChI Key: InChIKey=RNNCHYJSLVOISV-UHFFFAOYSA-N
Activity Spreadsheet -- Enzyme Inhibition Constant Data from BindingDB
Found 1 hit for monomerid = 50362379
Trg + Lig
Ki
nM
ΔG°
kcal/mole
IC50
nM
Kd
nM
EC50/IC50
nM
koff
s-1
kon
M-1s-1
pHTemp
°C
Muscarinic acetylcholine receptor M1
(Homo sapiens (Human))
BDBM50362379
(CHEMBL1939964)
Show SMILES Clc1cnc(nc1)N1CCN(CC1)C(=O)CCNS(=O)(=O)c1cccc2nsnc12
Show InChI InChI=1S/C17H18ClN7O3S2/c18-12-10-19-17(20-11-12)25-8-6-24(7-9-25)15(26)4-5-21-30(27,28)14-3-1-2-13-16(14)23-29-22-13/h1-3,10-11,21H,4-9H2
n/an/a>1.00E+4n/an/an/an/an/an/a
Vanderbilt University Medical Center
Curated by ChEMBL
Assay Description
Antagonist activity at human muscarinic M1 receptor expressed in CHO cells assessed as inhibition of acetylcholine-induced calcium mobilization by fl...
Bioorg Med Chem Lett 22: 1044-8 (2012)
Article DOI: 10.1016/j.bmcl.2011.11.110
BindingDB Entry DOI: 10.7270/Q2XS5VVC