BDBM50362384 CHEMBL1939969
SMILES: O=C(CCNS(=O)(=O)c1cccc2nonc12)N1CCN(CC1)c1ccncc1
InChI Key: InChIKey=NIMNOYXBYYVSQZ-UHFFFAOYSA-N
Data: 1 IC50
Activity Spreadsheet -- Enzyme Inhibition Constant Data from BindingDB
Found 1 hit for monomerid = 50362384
Trg + Lig
Ki
nM
ΔG°
kcal/mole
IC50
nM
Kd
nM
EC50/IC50
nM
koff
s-1
kon
M-1s-1
pHTemp
°C
Muscarinic acetylcholine receptor M1
(Homo sapiens (Human))
BDBM50362384
(CHEMBL1939969)
Show SMILES O=C(CCNS(=O)(=O)c1cccc2nonc12)N1CCN(CC1)c1ccncc1
Show InChI InChI=1S/C18H20N6O4S/c25-17(24-12-10-23(11-13-24)14-4-7-19-8-5-14)6-9-20-29(26,27)16-3-1-2-15-18(16)22-28-21-15/h1-5,7-8,20H,6,9-13H2
n/an/a 2.60E+3n/an/an/an/an/an/a
Vanderbilt University Medical Center
Curated by ChEMBL
Assay Description
Antagonist activity at human muscarinic M1 receptor expressed in CHO cells assessed as inhibition of acetylcholine-induced calcium mobilization by fl...
Bioorg Med Chem Lett 22: 1044-8 (2012)
Article DOI: 10.1016/j.bmcl.2011.11.110
BindingDB Entry DOI: 10.7270/Q2XS5VVC