null
SMILES: Brc1ccc(nc1)N1CCN(CC1)C(=O)CCNS(=O)(=O)c1cccc2ncccc12
InChI Key: InChIKey=LBRVIFSKGSDARX-UHFFFAOYSA-N
Activity Spreadsheet -- Enzyme Inhibition Constant Data from BindingDB
Found 1 hit for monomerid = 50362393
Trg + Lig
Ki
nM
ΔG°
kcal/mole
IC50
nM
Kd
nM
EC50/IC50
nM
koff
s-1
kon
M-1s-1
pHTemp
°C
Muscarinic acetylcholine receptor M1
(Homo sapiens (Human))
BDBM50362393
(CHEMBL1940124)
Show SMILES Brc1ccc(nc1)N1CCN(CC1)C(=O)CCNS(=O)(=O)c1cccc2ncccc12
Show InChI InChI=1S/C21H22BrN5O3S/c22-16-6-7-20(24-15-16)26-11-13-27(14-12-26)21(28)8-10-25-31(29,30)19-5-1-4-18-17(19)3-2-9-23-18/h1-7,9,15,25H,8,10-14H2
n/an/a 2.10E+3n/an/an/an/an/an/a
Vanderbilt University Medical Center
Curated by ChEMBL
Assay Description
Antagonist activity at human muscarinic M1 receptor expressed in CHO cells assessed as inhibition of acetylcholine-induced calcium mobilization by fl...
Bioorg Med Chem Lett 22: 1044-8 (2012)
Article DOI: 10.1016/j.bmcl.2011.11.110
BindingDB Entry DOI: 10.7270/Q2XS5VVC