BDBM50362411 CHEMBL1940541
SMILES: COc1ccc(cc1)C1(CCC1)N[C@@H]1CC[C@@H]([C@H](C1)c1ccsc1)C(=O)N1CCN(CC1)c1nnc(s1)C(F)(F)F
InChI Key: InChIKey=GGLJTFZSSXJGEQ-YFNKSVMNSA-N
Data: 4 IC50
Activity Spreadsheet -- Enzyme Inhibition Constant Data from BindingDB
Found 4 hits for monomerid = 50362411
Trg + Lig
Ki
nM
ΔG°
kcal/mole
IC50
nM
Kd
nM
EC50/IC50
nM
koff
s-1
kon
M-1s-1
pHTemp
°C
neuropeptides B/W receptor 1
(Homo sapiens (Human))
BDBM50362411
(CHEMBL1940541)
Show SMILES COc1ccc(cc1)C1(CCC1)N[C@@H]1CC[C@@H]([C@H](C1)c1ccsc1)C(=O)N1CCN(CC1)c1nnc(s1)C(F)(F)F |r|
Show InChI InChI=1S/C29H34F3N5O2S2/c1-39-22-6-3-20(4-7-22)28(10-2-11-28)33-21-5-8-23(24(17-21)19-9-16-40-18-19)25(38)36-12-14-37(15-13-36)27-35-34-26(41-27)29(30,31)32/h3-4,6-7,9,16,18,21,23-24,33H,2,5,8,10-15,17H2,1H3/t21-,23+,24-/m1/s1
Reactome pathway
n/an/a 342n/an/an/an/an/an/a
Merck& Co.
Curated by ChEMBL
Assay Description
Antagonist activity at human NPBWR1 expressed in CHO-K1 cells assessed as inhibition of hNPW23 and forskolin-stimulated cAMP production after 1 hr by...
Bioorg Med Chem Lett 22: 1014-8 (2012)
Article DOI: 10.1016/j.bmcl.2011.11.126
BindingDB Entry DOI: 10.7270/Q2P84CB4
Neuropeptides B/W receptor type 1
(Mus musculus)
BDBM50362411
(CHEMBL1940541)
Show SMILES COc1ccc(cc1)C1(CCC1)N[C@@H]1CC[C@@H]([C@H](C1)c1ccsc1)C(=O)N1CCN(CC1)c1nnc(s1)C(F)(F)F |r|
Show InChI InChI=1S/C29H34F3N5O2S2/c1-39-22-6-3-20(4-7-22)28(10-2-11-28)33-21-5-8-23(24(17-21)19-9-16-40-18-19)25(38)36-12-14-37(15-13-36)27-35-34-26(41-27)29(30,31)32/h3-4,6-7,9,16,18,21,23-24,33H,2,5,8,10-15,17H2,1H3/t21-,23+,24-/m1/s1
Reactome pathway
n/an/a 2.20n/an/an/an/an/an/a
Merck& Co.
Curated by ChEMBL
Assay Description
Displacement of [125]-hNPW23 from mouse NPBWR1 expressed in CHO-K1 cells membrane by scintillation proximity assay
Bioorg Med Chem Lett 22: 1014-8 (2012)
Article DOI: 10.1016/j.bmcl.2011.11.126
BindingDB Entry DOI: 10.7270/Q2P84CB4
Neuropeptides B/W receptor type 1
(Mus musculus)
BDBM50362411
(CHEMBL1940541)
Show SMILES COc1ccc(cc1)C1(CCC1)N[C@@H]1CC[C@@H]([C@H](C1)c1ccsc1)C(=O)N1CCN(CC1)c1nnc(s1)C(F)(F)F |r|
Show InChI InChI=1S/C29H34F3N5O2S2/c1-39-22-6-3-20(4-7-22)28(10-2-11-28)33-21-5-8-23(24(17-21)19-9-16-40-18-19)25(38)36-12-14-37(15-13-36)27-35-34-26(41-27)29(30,31)32/h3-4,6-7,9,16,18,21,23-24,33H,2,5,8,10-15,17H2,1H3/t21-,23+,24-/m1/s1
Reactome pathway
n/an/a 14n/an/an/an/an/an/a
Merck& Co.
Curated by ChEMBL
Assay Description
Antagonist activity at mouse NPBWR1 expressed in CHO-K1 cells assessed as inhibition of hNPW23 and forskolin-stimulated cAMP production after 1 hr by...
Bioorg Med Chem Lett 22: 1014-8 (2012)
Article DOI: 10.1016/j.bmcl.2011.11.126
BindingDB Entry DOI: 10.7270/Q2P84CB4
neuropeptides B/W receptor 1
(Homo sapiens (Human))
BDBM50362411
(CHEMBL1940541)
Show SMILES COc1ccc(cc1)C1(CCC1)N[C@@H]1CC[C@@H]([C@H](C1)c1ccsc1)C(=O)N1CCN(CC1)c1nnc(s1)C(F)(F)F |r|
Show InChI InChI=1S/C29H34F3N5O2S2/c1-39-22-6-3-20(4-7-22)28(10-2-11-28)33-21-5-8-23(24(17-21)19-9-16-40-18-19)25(38)36-12-14-37(15-13-36)27-35-34-26(41-27)29(30,31)32/h3-4,6-7,9,16,18,21,23-24,33H,2,5,8,10-15,17H2,1H3/t21-,23+,24-/m1/s1
Reactome pathway
n/an/a 95n/an/an/an/an/an/a
Merck& Co.
Curated by ChEMBL
Assay Description
Displacement of [125]-hNPW23 from human NPBWR1 expressed in CHO-K1 cells membrane by scintillation proximity assay
Bioorg Med Chem Lett 22: 1014-8 (2012)
Article DOI: 10.1016/j.bmcl.2011.11.126
BindingDB Entry DOI: 10.7270/Q2P84CB4