BDBM50362420 CHEMBL1940540
SMILES: COc1ccc(cc1)C1(CCC1)N[C@@H]1CC[C@@H]([C@H](C1)c1ccsc1)C(=O)N1CCN(CC1)c1nc2ccccc2s1
InChI Key: InChIKey=VSENKZAZCHPZLF-FPNNDXFKSA-N
Data: 2 IC50
Activity Spreadsheet -- Enzyme Inhibition Constant Data from BindingDB
Found 2 hits for monomerid = 50362420
Trg + Lig
Ki
nM
ΔG°
kcal/mole
IC50
nM
Kd
nM
EC50/IC50
nM
koff
s-1
kon
M-1s-1
pHTemp
°C
Neuropeptides B/W receptor type 1
(Mus musculus)
BDBM50362420
(CHEMBL1940540)
Show SMILES COc1ccc(cc1)C1(CCC1)N[C@@H]1CC[C@@H]([C@H](C1)c1ccsc1)C(=O)N1CCN(CC1)c1nc2ccccc2s1 |r|
Show InChI InChI=1S/C33H38N4O2S2/c1-39-26-10-7-24(8-11-26)33(14-4-15-33)35-25-9-12-27(28(21-25)23-13-20-40-22-23)31(38)36-16-18-37(19-17-36)32-34-29-5-2-3-6-30(29)41-32/h2-3,5-8,10-11,13,20,22,25,27-28,35H,4,9,12,14-19,21H2,1H3/t25-,27+,28-/m1/s1
Reactome pathway
n/an/a 0.330n/an/an/an/an/an/a
Merck& Co.
Curated by ChEMBL
Assay Description
Displacement of [125]-hNPW23 from mouse NPBWR1 expressed in CHO-K1 cells membrane by scintillation proximity assay
Bioorg Med Chem Lett 22: 1014-8 (2012)
Article DOI: 10.1016/j.bmcl.2011.11.126
BindingDB Entry DOI: 10.7270/Q2P84CB4
Neuropeptides B/W receptor type 1
(Mus musculus)
BDBM50362420
(CHEMBL1940540)
Show SMILES COc1ccc(cc1)C1(CCC1)N[C@@H]1CC[C@@H]([C@H](C1)c1ccsc1)C(=O)N1CCN(CC1)c1nc2ccccc2s1 |r|
Show InChI InChI=1S/C33H38N4O2S2/c1-39-26-10-7-24(8-11-26)33(14-4-15-33)35-25-9-12-27(28(21-25)23-13-20-40-22-23)31(38)36-16-18-37(19-17-36)32-34-29-5-2-3-6-30(29)41-32/h2-3,5-8,10-11,13,20,22,25,27-28,35H,4,9,12,14-19,21H2,1H3/t25-,27+,28-/m1/s1
Reactome pathway
n/an/a 1.80n/an/an/an/an/an/a
Merck& Co.
Curated by ChEMBL
Assay Description
Antagonist activity at mouse NPBWR1 expressed in CHO-K1 cells assessed as inhibition of hNPW23 and forskolin-stimulated cAMP production after 1 hr by...
Bioorg Med Chem Lett 22: 1014-8 (2012)
Article DOI: 10.1016/j.bmcl.2011.11.126
BindingDB Entry DOI: 10.7270/Q2P84CB4