BDBM50362528 CHEMBL1941005
SMILES: [O-][N+](=O)c1cccc(c1)C(=O)Cn1c(nc2ccccc12)-c1ccccn1
InChI Key: InChIKey=IGDYOIZCZLFYRW-UHFFFAOYSA-N
Data: 2 IC50
Activity Spreadsheet -- Enzyme Inhibition Constant Data from BindingDB
Found 2 hits for monomerid = 50362528
Trg + Lig
Ki
nM
ΔG°
kcal/mole
IC50
nM
Kd
nM
EC50/IC50
nM
koff
s-1
kon
M-1s-1
pHTemp
°C
Cathepsin D
(Homo sapiens (Human))
BDBM50362528
(CHEMBL1941005)
Show SMILES [O-][N+](=O)c1cccc(c1)C(=O)Cn1c(nc2ccccc12)-c1ccccn1
Show InChI InChI=1S/C20H14N4O3/c25-19(14-6-5-7-15(12-14)24(26)27)13-23-18-10-2-1-8-16(18)22-20(23)17-9-3-4-11-21-17/h1-12H,13H2
NCI pathway
Reactome pathway
n/an/a 2.12E+4n/an/an/an/an/an/a
University of Karachi
Curated by ChEMBL
Assay Description
Inhibition of human cathepsin D using DABCYL-Glu-Arg-Nle-Phe-Leu-Ser-Phe-Pro-EDANS as substrate by FRET analysis
Bioorg Med Chem Lett 22: 1282-6 (2012)
Article DOI: 10.1016/j.bmcl.2011.10.018
BindingDB Entry DOI: 10.7270/Q2WS8TPJ
Plasmepsin 2
(Plasmodium falciparum)
BDBM50362528
(CHEMBL1941005)
Show SMILES [O-][N+](=O)c1cccc(c1)C(=O)Cn1c(nc2ccccc12)-c1ccccn1
Show InChI InChI=1S/C20H14N4O3/c25-19(14-6-5-7-15(12-14)24(26)27)13-23-18-10-2-1-8-16(18)22-20(23)17-9-3-4-11-21-17/h1-12H,13H2
n/an/a 2.04E+4n/an/an/an/an/an/a
University of Karachi
Curated by ChEMBL
Assay Description
Inhibition of Plasmodium falciparum plasmepsin-2 using DABCYL-Glu-Arg-Nle-Phe-Leu-Ser-Phe-Pro-EDANS as substrate by FRET analysis
Bioorg Med Chem Lett 22: 1282-6 (2012)
Article DOI: 10.1016/j.bmcl.2011.10.018
BindingDB Entry DOI: 10.7270/Q2WS8TPJ