BDBM50363186 CHEMBL1946588
SMILES: [#6]\[#6](-[#6])=[#6]\[#6]-[#6]\[#6](-[#6])=[#6]\[#6]-[#6]\[#6](-[#6])=[#6]\[#6]-[#16]-[#6]-[#6@H](-[#7]-[#6](=O)-c1ccccc1-[#16]-c1ccccc1)-[#6](-[#8])=O
InChI Key: InChIKey=UJFBJGKNWBOYDS-NGKXTOPJSA-N
Data: 1 IC50
Activity Spreadsheet -- Enzyme Inhibition Constant Data from BindingDB
Found 1 hit for monomerid = 50363186
Trg + Lig
Ki
nM
ΔG°
kcal/mole
IC50
nM
Kd
nM
EC50/IC50
nM
koff
s-1
kon
M-1s-1
pHTemp
°C
Isoprenylcysteine carboxyl methyltransferase
(Homo sapiens (Human))
BDBM50363186
(CHEMBL1946588)
Show SMILES [#6]\[#6](-[#6])=[#6]\[#6]-[#6]\[#6](-[#6])=[#6]\[#6]-[#6]\[#6](-[#6])=[#6]\[#6]-[#16]-[#6]-[#6@H](-[#7]-[#6](=O)-c1ccccc1-[#16]-c1ccccc1)-[#6](-[#8])=O |r|
Show InChI InChI=1S/C31H39NO3S2/c1-23(2)12-10-13-24(3)14-11-15-25(4)20-21-36-22-28(31(34)35)32-30(33)27-18-8-9-19-29(27)37-26-16-6-5-7-17-26/h5-9,12,14,16-20,28H,10-11,13,15,21-22H2,1-4H3,(H,32,33)(H,34,35)/b24-14+,25-20+/t28-/m0/s1
n/an/a 1.47E+4n/an/an/an/an/an/a
Purdue University
Curated by ChEMBL
Assay Description
Inhibition of His-tagged human Icmt membrane protein over-expressed in Saccharomyces cerevisiae 2766 using [14C]-SAM and N-acetyl-S-farnesyl-l-cystei...
Bioorg Med Chem 20: 283-95 (2011)
Article DOI: 10.1016/j.bmc.2011.10.087
BindingDB Entry DOI: 10.7270/Q2QZ2BD2