null
SMILES: O=C1Nc2cccc(n2)-c2nncn2CCCCOc2ccc(cc12)-n1cnc(c1)C1CC1
InChI Key:
Activity Spreadsheet -- Enzyme Inhibition Constant Data from BindingDB
Found 3 hits for monomerid = 503635
Trg + Lig
Ki
nM
ΔG°
kcal/mole
IC50
nM
Kd
nM
EC50/IC50
nM
koff
s-1
kon
M-1s-1
pHTemp
°C
Mitogen-activated protein kinase kinase kinase 5
(Homo sapiens (Human))
BDBM503635
(US11034671, Example 22 | US11168095, Example 22)
Show SMILES O=C1Nc2cccc(n2)-c2nncn2CCCCOc2ccc(cc12)-n1cnc(c1)C1CC1
n/an/an/a<100n/an/an/an/an/a
TBA
Citation and Details
Mitogen-activated protein kinase kinase kinase 5
(Homo sapiens (Human))
BDBM503635
(US11034671, Example 22 | US11168095, Example 22)
Show SMILES O=C1Nc2cccc(n2)-c2nncn2CCCCOc2ccc(cc12)-n1cnc(c1)C1CC1
n/an/a<100n/an/an/an/an/an/a
TBA
Citation and Details
Mitogen-activated protein kinase kinase kinase 5
(Homo sapiens (Human))
BDBM503635
(US11034671, Example 22 | US11168095, Example 22)
Show SMILES O=C1Nc2cccc(n2)-c2nncn2CCCCOc2ccc(cc12)-n1cnc(c1)C1CC1
n/an/a<100n/an/an/an/an/an/a
TBA
Citation and Details