BDBM50363715 CHEMBL1944955
SMILES: CN(C)c1ccc(\C=C\c2sc3cc(C)ccc3[n+]2C)cc1
InChI Key: InChIKey=JRLFZSGKIAWSGP-UHFFFAOYSA-N
Data: 1 IC50
Activity Spreadsheet -- Enzyme Inhibition Constant Data from BindingDB
Found 1 hit for monomerid = 50363715
Trg + Lig
Ki
nM
ΔG°
kcal/mole
IC50
nM
Kd
nM
EC50/IC50
nM
koff
s-1
kon
M-1s-1
pHTemp
°C
Insulin receptor
(Homo sapiens (Human))
BDBM50363715
(CHEMBL1944955)
Show SMILES CN(C)c1ccc(\C=C\c2sc3cc(C)ccc3[n+]2C)cc1
Show InChI InChI=1S/C19H21N2S/c1-14-5-11-17-18(13-14)22-19(21(17)4)12-8-15-6-9-16(10-7-15)20(2)3/h5-13H,1-4H3/q+1
n/an/a 6n/an/an/an/an/an/a
The Ohio State University College of Medicine
Curated by ChEMBL
Assay Description
Displacement of thioflavin T from insulin receptor by thioflavin-T fluorescent dye assay
Bioorg Med Chem 20: 1434-41 (2012)
Article DOI: 10.1016/j.bmc.2011.12.062
BindingDB Entry DOI: 10.7270/Q2M32W7W