BDBM50364086 CHEMBL1950833
SMILES: COCCCc1cc(ccn1)S(=O)(=O)c1ccc2n(CC3CCOCC3)c(nc2c1)C(C)(C)C
InChI Key: InChIKey=VDWODMZVUHYEHU-UHFFFAOYSA-N
Data: 2 EC50
Activity Spreadsheet -- Enzyme Inhibition Constant Data from BindingDB
Found 2 hits for monomerid = 50364086
Trg + Lig
Ki
nM
ΔG°
kcal/mole
IC50
nM
Kd
nM
EC50/IC50
nM
koff
s-1
kon
M-1s-1
pHTemp
°C
Cannabinoid receptor 2
(Homo sapiens (Human))
BDBM50364086
(CHEMBL1950833)
Show SMILES COCCCc1cc(ccn1)S(=O)(=O)c1ccc2n(CC3CCOCC3)c(nc2c1)C(C)(C)C
Show InChI InChI=1S/C26H35N3O4S/c1-26(2,3)25-28-23-17-21(7-8-24(23)29(25)18-19-10-14-33-15-11-19)34(30,31)22-9-12-27-20(16-22)6-5-13-32-4/h7-9,12,16-17,19H,5-6,10-11,13-15,18H2,1-4H3
Reactome pathway
n/an/an/an/a 1.10n/an/an/an/a
Janssen Research& Development
Curated by ChEMBL
Assay Description
Agonist activity at human CB2 receptor
Bioorg Med Chem Lett 22: 547-52 (2011)
Article DOI: 10.1016/j.bmcl.2011.10.091
BindingDB Entry DOI: 10.7270/Q2JW8FBF
Cannabinoid receptor 1
(Homo sapiens (Human))
BDBM50364086
(CHEMBL1950833)
Show SMILES COCCCc1cc(ccn1)S(=O)(=O)c1ccc2n(CC3CCOCC3)c(nc2c1)C(C)(C)C
Show InChI InChI=1S/C26H35N3O4S/c1-26(2,3)25-28-23-17-21(7-8-24(23)29(25)18-19-10-14-33-15-11-19)34(30,31)22-9-12-27-20(16-22)6-5-13-32-4/h7-9,12,16-17,19H,5-6,10-11,13-15,18H2,1-4H3
NCI pathway
Reactome pathway
n/an/an/an/a>1.00E+4n/an/an/an/a
Janssen Research& Development
Curated by ChEMBL
Assay Description
Agonist activity at human CB1 receptor
Bioorg Med Chem Lett 22: 547-52 (2011)
Article DOI: 10.1016/j.bmcl.2011.10.091
BindingDB Entry DOI: 10.7270/Q2JW8FBF