BDBM50364101 CHEMBL1950927
SMILES: CC(C)(C)c1nc2cc(ccc2n1CC1CCS(=O)(=O)CC1)S(=O)(=O)CC1CC1
InChI Key: InChIKey=WYOQPSLZYOPQBI-UHFFFAOYSA-N
Data: 2 EC50
Activity Spreadsheet -- Enzyme Inhibition Constant Data from BindingDB
Found 2 hits for monomerid = 50364101
Trg + Lig
Ki
nM
ΔG°
kcal/mole
IC50
nM
Kd
nM
EC50/IC50
nM
koff
s-1
kon
M-1s-1
pHTemp
°C
Cannabinoid receptor 2
(Homo sapiens (Human))
BDBM50364101
(CHEMBL1950927)
Show SMILES CC(C)(C)c1nc2cc(ccc2n1CC1CCS(=O)(=O)CC1)S(=O)(=O)CC1CC1
Show InChI InChI=1S/C21H30N2O4S2/c1-21(2,3)20-22-18-12-17(29(26,27)14-16-4-5-16)6-7-19(18)23(20)13-15-8-10-28(24,25)11-9-15/h6-7,12,15-16H,4-5,8-11,13-14H2,1-3H3
Reactome pathway
n/an/an/an/a 8.40n/an/an/an/a
Janssen Research& Development
Curated by ChEMBL
Assay Description
Agonist activity at human CB2 receptor
Bioorg Med Chem Lett 22: 547-52 (2011)
Article DOI: 10.1016/j.bmcl.2011.10.091
BindingDB Entry DOI: 10.7270/Q2JW8FBF
Cannabinoid receptor 1
(Homo sapiens (Human))
BDBM50364101
(CHEMBL1950927)
Show SMILES CC(C)(C)c1nc2cc(ccc2n1CC1CCS(=O)(=O)CC1)S(=O)(=O)CC1CC1
Show InChI InChI=1S/C21H30N2O4S2/c1-21(2,3)20-22-18-12-17(29(26,27)14-16-4-5-16)6-7-19(18)23(20)13-15-8-10-28(24,25)11-9-15/h6-7,12,15-16H,4-5,8-11,13-14H2,1-3H3
NCI pathway
Reactome pathway
n/an/an/an/a 2.68E+3n/an/an/an/a
Janssen Research& Development
Curated by ChEMBL
Assay Description
Agonist activity at human CB1 receptor
Bioorg Med Chem Lett 22: 547-52 (2011)
Article DOI: 10.1016/j.bmcl.2011.10.091
BindingDB Entry DOI: 10.7270/Q2JW8FBF