BDBM50364103 CHEMBL1950929
SMILES: COCCS(=O)(=O)c1ccc2n(CC3CCN(CC3)C(C)=O)c(nc2c1)C(C)(C)C
InChI Key: InChIKey=FEVKIXALEHGMMS-UHFFFAOYSA-N
Data: 2 EC50
Activity Spreadsheet -- Enzyme Inhibition Constant Data from BindingDB
Found 2 hits for monomerid = 50364103
Trg + Lig
Ki
nM
ΔG°
kcal/mole
IC50
nM
Kd
nM
EC50/IC50
nM
koff
s-1
kon
M-1s-1
pHTemp
°C
Cannabinoid receptor 2
(Homo sapiens (Human))
BDBM50364103
(CHEMBL1950929)
Show SMILES COCCS(=O)(=O)c1ccc2n(CC3CCN(CC3)C(C)=O)c(nc2c1)C(C)(C)C
Show InChI InChI=1S/C22H33N3O4S/c1-16(26)24-10-8-17(9-11-24)15-25-20-7-6-18(30(27,28)13-12-29-5)14-19(20)23-21(25)22(2,3)4/h6-7,14,17H,8-13,15H2,1-5H3
Reactome pathway
n/an/an/an/a 26n/an/an/an/a
Janssen Research& Development
Curated by ChEMBL
Assay Description
Agonist activity at human CB2 receptor
Bioorg Med Chem Lett 22: 547-52 (2011)
Article DOI: 10.1016/j.bmcl.2011.10.091
BindingDB Entry DOI: 10.7270/Q2JW8FBF
Cannabinoid receptor 1
(Homo sapiens (Human))
BDBM50364103
(CHEMBL1950929)
Show SMILES COCCS(=O)(=O)c1ccc2n(CC3CCN(CC3)C(C)=O)c(nc2c1)C(C)(C)C
Show InChI InChI=1S/C22H33N3O4S/c1-16(26)24-10-8-17(9-11-24)15-25-20-7-6-18(30(27,28)13-12-29-5)14-19(20)23-21(25)22(2,3)4/h6-7,14,17H,8-13,15H2,1-5H3
NCI pathway
Reactome pathway
n/an/an/an/a>1.00E+4n/an/an/an/a
Janssen Research& Development
Curated by ChEMBL
Assay Description
Agonist activity at human CB1 receptor
Bioorg Med Chem Lett 22: 547-52 (2011)
Article DOI: 10.1016/j.bmcl.2011.10.091
BindingDB Entry DOI: 10.7270/Q2JW8FBF