BDBM50364156 CHEMBL1951432
SMILES: [#6]\[#6](-[#6])=[#6]\[#6]-n1c(-[#7]-2-[#6]-[#6]-[#6]-[#6@H](-[#7])-[#6]-2)c(C#N)c2ncn(-[#6]-c3nccc4ccccc34)c(=O)c12
InChI Key: InChIKey=VXTXSTJYACXQSO-FQEVSTJZSA-N
Data: 3 IC50
Activity Spreadsheet -- Enzyme Inhibition Constant Data from BindingDB
Found 3 hits for monomerid = 50364156
Trg + Lig
Ki
nM
ΔG°
kcal/mole
IC50
nM
Kd
nM
EC50/IC50
nM
koff
s-1
kon
M-1s-1
pHTemp
°C
Muscarinic acetylcholine receptor M1
(Homo sapiens (Human))
BDBM50364156
(CHEMBL1951432)
Show SMILES [#6]\[#6](-[#6])=[#6]\[#6]-n1c(-[#7]-2-[#6]-[#6]-[#6]-[#6@H](-[#7])-[#6]-2)c(C#N)c2ncn(-[#6]-c3nccc4ccccc34)c(=O)c12 |r|
Show InChI InChI=1S/C27H29N7O/c1-18(2)10-13-34-25-24(22(14-28)26(34)32-12-5-7-20(29)15-32)31-17-33(27(25)35)16-23-21-8-4-3-6-19(21)9-11-30-23/h3-4,6,8-11,17,20H,5,7,12-13,15-16,29H2,1-2H3/t20-/m0/s1
n/an/a>1.00E+4n/an/an/an/an/an/a
Argenta Discovery Ltd.
Curated by ChEMBL
Assay Description
Inhibition of M1 receptor
Bioorg Med Chem Lett 22: 1464-8 (2012)
Article DOI: 10.1016/j.bmcl.2011.11.054
BindingDB Entry DOI: 10.7270/Q2SF2WN8
Dipeptidyl peptidase 4
(Homo sapiens (Human))
BDBM50364156
(CHEMBL1951432)
Show SMILES [#6]\[#6](-[#6])=[#6]\[#6]-n1c(-[#7]-2-[#6]-[#6]-[#6]-[#6@H](-[#7])-[#6]-2)c(C#N)c2ncn(-[#6]-c3nccc4ccccc34)c(=O)c12 |r|
Show InChI InChI=1S/C27H29N7O/c1-18(2)10-13-34-25-24(22(14-28)26(34)32-12-5-7-20(29)15-32)31-17-33(27(25)35)16-23-21-8-4-3-6-19(21)9-11-30-23/h3-4,6,8-11,17,20H,5,7,12-13,15-16,29H2,1-2H3/t20-/m0/s1
Reactome pathway
n/an/a 0.5n/an/an/an/an/an/a
Argenta Discovery Ltd.
Curated by ChEMBL
Assay Description
Inhibition of human C-terminal step-tagged DPP4 expressed using baculovirus system
Bioorg Med Chem Lett 22: 1464-8 (2012)
Article DOI: 10.1016/j.bmcl.2011.11.054
BindingDB Entry DOI: 10.7270/Q2SF2WN8
Cytochrome P450 3A4
(Homo sapiens (Human))
BDBM50364156
(CHEMBL1951432)
Show SMILES [#6]\[#6](-[#6])=[#6]\[#6]-n1c(-[#7]-2-[#6]-[#6]-[#6]-[#6@H](-[#7])-[#6]-2)c(C#N)c2ncn(-[#6]-c3nccc4ccccc34)c(=O)c12 |r|
Show InChI InChI=1S/C27H29N7O/c1-18(2)10-13-34-25-24(22(14-28)26(34)32-12-5-7-20(29)15-32)31-17-33(27(25)35)16-23-21-8-4-3-6-19(21)9-11-30-23/h3-4,6,8-11,17,20H,5,7,12-13,15-16,29H2,1-2H3/t20-/m0/s1
Reactome pathway
n/an/a 1.70E+3n/an/an/an/an/an/a
Argenta Discovery Ltd.
Curated by ChEMBL
Assay Description
Inhibition of CYP3A4
Bioorg Med Chem Lett 22: 1464-8 (2012)
Article DOI: 10.1016/j.bmcl.2011.11.054
BindingDB Entry DOI: 10.7270/Q2SF2WN8