BDBM50364179 CHEMBL1951607
SMILES: [#6]-[#8]-c1cccc(c1)-[#6](=O)-[#6]-n1c(=O)n(-[#6])c2c(C#N)c(-[#7]-3-[#6]-[#6]-[#6]-[#7]-[#6]-[#6]-3)n(-[#6]\[#6]=[#6](\[#6])-[#6])c2c1=O
InChI Key: InChIKey=UHCGBYNFQULPRR-UHFFFAOYSA-N
Data: 3 IC50
Activity Spreadsheet -- Enzyme Inhibition Constant Data from BindingDB
Found 3 hits for monomerid = 50364179
Trg + Lig
Ki
nM
ΔG°
kcal/mole
IC50
nM
Kd
nM
EC50/IC50
nM
koff
s-1
kon
M-1s-1
pHTemp
°C
Potassium voltage-gated channel subfamily H member 2
(Homo sapiens (Human))
BDBM50364179
(CHEMBL1951607)
Show SMILES [#6]-[#8]-c1cccc(c1)-[#6](=O)-[#6]-n1c(=O)n(-[#6])c2c(C#N)c(-[#7]-3-[#6]-[#6]-[#6]-[#7]-[#6]-[#6]-3)n(-[#6]\[#6]=[#6](\[#6])-[#6])c2c1=O
Show InChI InChI=1S/C27H32N6O4/c1-18(2)9-13-32-24-23(21(16-28)25(32)31-12-6-10-29-11-14-31)30(3)27(36)33(26(24)35)17-22(34)19-7-5-8-20(15-19)37-4/h5,7-9,15,29H,6,10-14,17H2,1-4H3
Reactome pathway
n/an/a 1.10E+3n/an/an/an/an/an/a
Argenta Discovery Ltd.
Curated by ChEMBL
Assay Description
Inhibition of human ERG by dofetilide binding assay
Bioorg Med Chem Lett 22: 1464-8 (2012)
Article DOI: 10.1016/j.bmcl.2011.11.054
BindingDB Entry DOI: 10.7270/Q2SF2WN8
Dipeptidyl peptidase 4
(Homo sapiens (Human))
BDBM50364179
(CHEMBL1951607)
Show SMILES [#6]-[#8]-c1cccc(c1)-[#6](=O)-[#6]-n1c(=O)n(-[#6])c2c(C#N)c(-[#7]-3-[#6]-[#6]-[#6]-[#7]-[#6]-[#6]-3)n(-[#6]\[#6]=[#6](\[#6])-[#6])c2c1=O
Show InChI InChI=1S/C27H32N6O4/c1-18(2)9-13-32-24-23(21(16-28)25(32)31-12-6-10-29-11-14-31)30(3)27(36)33(26(24)35)17-22(34)19-7-5-8-20(15-19)37-4/h5,7-9,15,29H,6,10-14,17H2,1-4H3
Reactome pathway
n/an/a 2n/an/an/an/an/an/a
Argenta Discovery Ltd.
Curated by ChEMBL
Assay Description
Inhibition of human C-terminal step-tagged DPP4 expressed using baculovirus system
Bioorg Med Chem Lett 22: 1464-8 (2012)
Article DOI: 10.1016/j.bmcl.2011.11.054
BindingDB Entry DOI: 10.7270/Q2SF2WN8
Muscarinic acetylcholine receptor M1
(Homo sapiens (Human))
BDBM50364179
(CHEMBL1951607)
Show SMILES [#6]-[#8]-c1cccc(c1)-[#6](=O)-[#6]-n1c(=O)n(-[#6])c2c(C#N)c(-[#7]-3-[#6]-[#6]-[#6]-[#7]-[#6]-[#6]-3)n(-[#6]\[#6]=[#6](\[#6])-[#6])c2c1=O
Show InChI InChI=1S/C27H32N6O4/c1-18(2)9-13-32-24-23(21(16-28)25(32)31-12-6-10-29-11-14-31)30(3)27(36)33(26(24)35)17-22(34)19-7-5-8-20(15-19)37-4/h5,7-9,15,29H,6,10-14,17H2,1-4H3
n/an/a>1.00E+4n/an/an/an/an/an/a
Argenta Discovery Ltd.
Curated by ChEMBL
Assay Description
Inhibition of M1 receptor
Bioorg Med Chem Lett 22: 1464-8 (2012)
Article DOI: 10.1016/j.bmcl.2011.11.054
BindingDB Entry DOI: 10.7270/Q2SF2WN8