null
SMILES: COc1ncccc1C(OC1CN(C1)C(=O)N1CCCCC1)c1ccc(Cl)cc1
InChI Key: InChIKey=VDEYZZWPCLNWLU-UHFFFAOYSA-N
Activity Spreadsheet -- Enzyme Inhibition Constant Data from BindingDB
Found 2 hits for monomerid = 50364250
Trg + Lig
Ki
nM
ΔG°
kcal/mole
IC50
nM
Kd
nM
EC50/IC50
nM
koff
s-1
kon
M-1s-1
pHTemp
°C
Fatty-acid amide hydrolase 1 [30-579]
(Rattus norvegicus (rat))
BDBM50364250
(CHEMBL1952082)
Show SMILES COc1ncccc1C(OC1CN(C1)C(=O)N1CCCCC1)c1ccc(Cl)cc1
Show InChI InChI=1S/C22H26ClN3O3/c1-28-21-19(6-5-11-24-21)20(16-7-9-17(23)10-8-16)29-18-14-26(15-18)22(27)25-12-3-2-4-13-25/h5-11,18,20H,2-4,12-15H2,1H3
n/an/a 2.48E+3n/an/an/an/an/an/a
Vernalis (R&D) Ltd
Curated by ChEMBL
Assay Description
Inhibition of rat FAAH using 7-amino-4-methylcoumarine amide as substrate preincubated for 1 hr by fluorimetry
Bioorg Med Chem Lett 22: 901-6 (2012)
Article DOI: 10.1016/j.bmcl.2011.12.032
BindingDB Entry DOI: 10.7270/Q2D79BVH
Fatty-acid amide hydrolase 1
(Homo sapiens (Human))
BDBM50364250
(CHEMBL1952082)
Show SMILES COc1ncccc1C(OC1CN(C1)C(=O)N1CCCCC1)c1ccc(Cl)cc1
Show InChI InChI=1S/C22H26ClN3O3/c1-28-21-19(6-5-11-24-21)20(16-7-9-17(23)10-8-16)29-18-14-26(15-18)22(27)25-12-3-2-4-13-25/h5-11,18,20H,2-4,12-15H2,1H3
n/an/a 6.19E+3n/an/an/an/an/an/a
Vernalis (R&D) Ltd
Curated by ChEMBL
Assay Description
Inhibition of human FAAH expressed in CHO cells using 7-amino-4-methylcoumarine amide as substrate preincubated for 1 hr by fluorimetry
Bioorg Med Chem Lett 22: 901-6 (2012)
Article DOI: 10.1016/j.bmcl.2011.12.032
BindingDB Entry DOI: 10.7270/Q2D79BVH