BDBM50364274 CHEMBL1952272
SMILES: Clc1ccc(cc1)C(OC1CN(C1)C(=O)NCc1ccccc1)c1cccnc1Cl
InChI Key: InChIKey=IRSFFPSIZQQYCD-UHFFFAOYSA-N
Data: 2 IC50
Activity Spreadsheet -- Enzyme Inhibition Constant Data from BindingDB
Found 2 hits for monomerid = 50364274
Trg + Lig
Ki
nM
ΔG°
kcal/mole
IC50
nM
Kd
nM
EC50/IC50
nM
koff
s-1
kon
M-1s-1
pHTemp
°C
Fatty-acid amide hydrolase 1 (aa 30-579)
(Rattus norvegicus (rat))
BDBM50364274
(CHEMBL1952272)
Show SMILES Clc1ccc(cc1)C(OC1CN(C1)C(=O)NCc1ccccc1)c1cccnc1Cl
Show InChI InChI=1S/C23H21Cl2N3O2/c24-18-10-8-17(9-11-18)21(20-7-4-12-26-22(20)25)30-19-14-28(15-19)23(29)27-13-16-5-2-1-3-6-16/h1-12,19,21H,13-15H2,(H,27,29)
n/an/a 1.15E+4n/an/an/an/an/an/a
Vernalis (R&D) Ltd
Curated by ChEMBL
Assay Description
Inhibition of rat FAAH using 7-amino-4-methylcoumarine amide as substrate preincubated for 1 hr by fluorimetry
Bioorg Med Chem Lett 22: 901-6 (2012)
Article DOI: 10.1016/j.bmcl.2011.12.032
BindingDB Entry DOI: 10.7270/Q2D79BVH
Fatty-acid amide hydrolase 1
(Homo sapiens (Human))
BDBM50364274
(CHEMBL1952272)
Show SMILES Clc1ccc(cc1)C(OC1CN(C1)C(=O)NCc1ccccc1)c1cccnc1Cl
Show InChI InChI=1S/C23H21Cl2N3O2/c24-18-10-8-17(9-11-18)21(20-7-4-12-26-22(20)25)30-19-14-28(15-19)23(29)27-13-16-5-2-1-3-6-16/h1-12,19,21H,13-15H2,(H,27,29)
n/an/a>5.00E+5n/an/an/an/an/an/a
Vernalis (R&D) Ltd
Curated by ChEMBL
Assay Description
Inhibition of human FAAH expressed in CHO cells using 7-amino-4-methylcoumarine amide as substrate preincubated for 1 hr by fluorimetry
Bioorg Med Chem Lett 22: 901-6 (2012)
Article DOI: 10.1016/j.bmcl.2011.12.032
BindingDB Entry DOI: 10.7270/Q2D79BVH