BDBM50364276 CHEMBL1952274
SMILES: Clc1ccc(cc1)C(OC1CN(C1)C(=O)N(Cc1ccccc1)Cc1ccccc1)c1cccnc1Cl
InChI Key: InChIKey=BBDMTVCBZGIJIB-UHFFFAOYSA-N
Data: 2 IC50
Activity Spreadsheet -- Enzyme Inhibition Constant Data from BindingDB
Found 2 hits for monomerid = 50364276
Trg + Lig
Ki
nM
ΔG°
kcal/mole
IC50
nM
Kd
nM
EC50/IC50
nM
koff
s-1
kon
M-1s-1
pHTemp
°C
Fatty-acid amide hydrolase 1 (aa 30-579)
(Rattus norvegicus (rat))
BDBM50364276
(CHEMBL1952274)
Show SMILES Clc1ccc(cc1)C(OC1CN(C1)C(=O)N(Cc1ccccc1)Cc1ccccc1)c1cccnc1Cl
Show InChI InChI=1S/C30H27Cl2N3O2/c31-25-15-13-24(14-16-25)28(27-12-7-17-33-29(27)32)37-26-20-35(21-26)30(36)34(18-22-8-3-1-4-9-22)19-23-10-5-2-6-11-23/h1-17,26,28H,18-21H2
n/an/a 5.41E+3n/an/an/an/an/an/a
Vernalis (R&D) Ltd
Curated by ChEMBL
Assay Description
Inhibition of rat FAAH using 7-amino-4-methylcoumarine amide as substrate preincubated for 1 hr by fluorimetry
Bioorg Med Chem Lett 22: 901-6 (2012)
Article DOI: 10.1016/j.bmcl.2011.12.032
BindingDB Entry DOI: 10.7270/Q2D79BVH
Fatty-acid amide hydrolase 1
(Homo sapiens (Human))
BDBM50364276
(CHEMBL1952274)
Show SMILES Clc1ccc(cc1)C(OC1CN(C1)C(=O)N(Cc1ccccc1)Cc1ccccc1)c1cccnc1Cl
Show InChI InChI=1S/C30H27Cl2N3O2/c31-25-15-13-24(14-16-25)28(27-12-7-17-33-29(27)32)37-26-20-35(21-26)30(36)34(18-22-8-3-1-4-9-22)19-23-10-5-2-6-11-23/h1-17,26,28H,18-21H2
n/an/a>5.00E+5n/an/an/an/an/an/a
Vernalis (R&D) Ltd
Curated by ChEMBL
Assay Description
Inhibition of human FAAH expressed in CHO cells using 7-amino-4-methylcoumarine amide as substrate preincubated for 1 hr by fluorimetry
Bioorg Med Chem Lett 22: 901-6 (2012)
Article DOI: 10.1016/j.bmcl.2011.12.032
BindingDB Entry DOI: 10.7270/Q2D79BVH