BDBM50364484 CHEMBL1950864
SMILES: CN[C@@H](C)C(=O)N[C@@H](C1CCCCC1)C(=O)N[C@H]1C[C@@H]2CC[C@H]1N(CCc1ccccc1)C2
InChI Key: InChIKey=GBQXNBCXOOCMBG-GILAWRQCSA-N
Data: 2 IC50  1 Kd  1 EC50
Activity Spreadsheet -- Enzyme Inhibition Constant Data from BindingDB
Found 4 hits for monomerid = 50364484
Trg + Lig
Ki
nM
ΔG°
kcal/mole
IC50
nM
Kd
nM
EC50/IC50
nM
koff
s-1
kon
M-1s-1
pHTemp
°C
X-linked inhibitor of apoptosis protein (XIAP)
(Homo sapiens (Human))
BDBM50364484
(CHEMBL1950864)
Show SMILES CN[C@@H](C)C(=O)N[C@@H](C1CCCCC1)C(=O)N[C@H]1C[C@@H]2CC[C@H]1N(CCc1ccccc1)C2 |r,TLB:24:23:17.18:21.20|
Show InChI InChI=1S/C27H42N4O2/c1-19(28-2)26(32)30-25(22-11-7-4-8-12-22)27(33)29-23-17-21-13-14-24(23)31(18-21)16-15-20-9-5-3-6-10-20/h3,5-6,9-10,19,21-25,28H,4,7-8,11-18H2,1-2H3,(H,29,33)(H,30,32)/t19-,21-,23-,24+,25-/m0/s1
n/an/an/a 900n/an/an/an/an/a
AstraZeneca R&D Boston
Curated by ChEMBL
Assay Description
Binding affinity to GST-tagged BIR3 domain of XIAP by isothermal titration calorimetry
Bioorg Med Chem Lett 22: 1690-4 (2012)
Article DOI: 10.1016/j.bmcl.2011.12.109
BindingDB Entry DOI: 10.7270/Q2G161BG
Baculoviral IAP repeat-containing protein 2
(Homo sapiens (Human))
BDBM50364484
(CHEMBL1950864)
Show SMILES CN[C@@H](C)C(=O)N[C@@H](C1CCCCC1)C(=O)N[C@H]1C[C@@H]2CC[C@H]1N(CCc1ccccc1)C2 |r,TLB:24:23:17.18:21.20|
Show InChI InChI=1S/C27H42N4O2/c1-19(28-2)26(32)30-25(22-11-7-4-8-12-22)27(33)29-23-17-21-13-14-24(23)31(18-21)16-15-20-9-5-3-6-10-20/h3,5-6,9-10,19,21-25,28H,4,7-8,11-18H2,1-2H3,(H,29,33)(H,30,32)/t19-,21-,23-,24+,25-/m0/s1
n/an/a 4n/an/an/an/an/an/a
AstraZeneca R&D Boston
Curated by ChEMBL
Assay Description
Antagonist activity at GST-tagged BIR3 domain of cIAP1 using AbuRPFK-5FAM after 20 mins by fluorescence polarization assay
Bioorg Med Chem Lett 22: 1690-4 (2012)
Article DOI: 10.1016/j.bmcl.2011.12.109
BindingDB Entry DOI: 10.7270/Q2G161BG
Baculoviral IAP repeat-containing protein 2
(Homo sapiens (Human))
BDBM50364484
(CHEMBL1950864)
Show SMILES CN[C@@H](C)C(=O)N[C@@H](C1CCCCC1)C(=O)N[C@H]1C[C@@H]2CC[C@H]1N(CCc1ccccc1)C2 |r,TLB:24:23:17.18:21.20|
Show InChI InChI=1S/C27H42N4O2/c1-19(28-2)26(32)30-25(22-11-7-4-8-12-22)27(33)29-23-17-21-13-14-24(23)31(18-21)16-15-20-9-5-3-6-10-20/h3,5-6,9-10,19,21-25,28H,4,7-8,11-18H2,1-2H3,(H,29,33)(H,30,32)/t19-,21-,23-,24+,25-/m0/s1
n/an/an/an/a 5n/an/an/an/a
AstraZeneca R&D Boston
Curated by ChEMBL
Assay Description
Antagonist activity at cIAP1 in human MDA-MB-231 cells assessed as cIAP1 degradation after 1 hr by ELISA
Bioorg Med Chem Lett 22: 1690-4 (2012)
Article DOI: 10.1016/j.bmcl.2011.12.109
BindingDB Entry DOI: 10.7270/Q2G161BG
X-linked inhibitor of apoptosis protein (XIAP)
(Homo sapiens (Human))
BDBM50364484
(CHEMBL1950864)
Show SMILES CN[C@@H](C)C(=O)N[C@@H](C1CCCCC1)C(=O)N[C@H]1C[C@@H]2CC[C@H]1N(CCc1ccccc1)C2 |r,TLB:24:23:17.18:21.20|
Show InChI InChI=1S/C27H42N4O2/c1-19(28-2)26(32)30-25(22-11-7-4-8-12-22)27(33)29-23-17-21-13-14-24(23)31(18-21)16-15-20-9-5-3-6-10-20/h3,5-6,9-10,19,21-25,28H,4,7-8,11-18H2,1-2H3,(H,29,33)(H,30,32)/t19-,21-,23-,24+,25-/m0/s1
n/an/a 365n/an/an/an/an/an/a
AstraZeneca R&D Boston
Curated by ChEMBL
Assay Description
Antagonist activity at GST-tagged BIR3 domain of XIAP using AbuRPFK-5FAM after 20 mins by fluorescence polarization assay
Bioorg Med Chem Lett 22: 1690-4 (2012)
Article DOI: 10.1016/j.bmcl.2011.12.109
BindingDB Entry DOI: 10.7270/Q2G161BG