null
SMILES: O=C(Nc1ccc(cc1)-c1ccc(cc1)C#N)Nc1ccc(cc1)-c1ccnc2nc[nH]c12
InChI Key: InChIKey=FEDMEJWMCJAMHE-UHFFFAOYSA-N
Activity Spreadsheet -- Enzyme Inhibition Constant Data from BindingDB
Found 2 hits for monomerid = 50364654
Trg + Lig
Ki
nM
ΔG°
kcal/mole
IC50
nM
Kd
nM
EC50/IC50
nM
koff
s-1
kon
M-1s-1
pHTemp
°C
Cytochrome P450 3A5
(Homo sapiens (Human))
BDBM50364654
(CHEMBL1951444)
Show SMILES O=C(Nc1ccc(cc1)-c1ccc(cc1)C#N)Nc1ccc(cc1)-c1ccnc2nc[nH]c12
Show InChI InChI=1S/C26H18N6O/c27-15-17-1-3-18(4-2-17)19-5-9-21(10-6-19)31-26(33)32-22-11-7-20(8-12-22)23-13-14-28-25-24(23)29-16-30-25/h1-14,16H,(H,28,29,30)(H2,31,32,33)
n/an/a 3.30E+4n/an/an/an/an/an/a
The Scripps Research Institute
Curated by ChEMBL
Assay Description
Inhibition of recombinant human CYP3A5 in supersomes using midazolam as substrate after 5 mins by LC-MS/MS analysis
Bioorg Med Chem Lett 22: 1611-4 (2012)
Article DOI: 10.1016/j.bmcl.2011.12.125
BindingDB Entry DOI: 10.7270/Q2T72HXJ
Cytochrome P450 3A4
(Homo sapiens (Human))
BDBM50364654
(CHEMBL1951444)
Show SMILES O=C(Nc1ccc(cc1)-c1ccc(cc1)C#N)Nc1ccc(cc1)-c1ccnc2nc[nH]c12
Show InChI InChI=1S/C26H18N6O/c27-15-17-1-3-18(4-2-17)19-5-9-21(10-6-19)31-26(33)32-22-11-7-20(8-12-22)23-13-14-28-25-24(23)29-16-30-25/h1-14,16H,(H,28,29,30)(H2,31,32,33)
Reactome pathway
n/an/a 11n/an/an/an/an/an/a
The Scripps Research Institute
Curated by ChEMBL
Assay Description
Inhibition of recombinant human CYP3A4 in supersomes using midazolam as substrate after 5 mins by LC-MS/MS analysis
Bioorg Med Chem Lett 22: 1611-4 (2012)
Article DOI: 10.1016/j.bmcl.2011.12.125
BindingDB Entry DOI: 10.7270/Q2T72HXJ