BDBM50364935 CHEMBL1950350
SMILES: CCS(=O)(=O)n1c2CCN(Cc2c2cc(ccc12)C(=O)N1CCC(C)CC1)C1CCCC1
InChI Key: InChIKey=BZYPOSYJBZSSOY-UHFFFAOYSA-N
Data: 1 KI  1 EC50
Activity Spreadsheet -- Enzyme Inhibition Constant Data from BindingDB
Found 2 hits for monomerid = 50364935
Trg + Lig
Ki
nM
ΔG°
kcal/mole
IC50
nM
Kd
nM
EC50/IC50
nM
koff
s-1
kon
M-1s-1
pHTemp
°C
Cannabinoid receptor 1
(Homo sapiens (Human))
BDBM50364935
(CHEMBL1950350)
Show SMILES CCS(=O)(=O)n1c2CCN(Cc2c2cc(ccc12)C(=O)N1CCC(C)CC1)C1CCCC1
Show InChI InChI=1S/C25H35N3O3S/c1-3-32(30,31)28-23-9-8-19(25(29)26-13-10-18(2)11-14-26)16-21(23)22-17-27(15-12-24(22)28)20-6-4-5-7-20/h8-9,16,18,20H,3-7,10-15,17H2,1-2H3
NCI pathway
Reactome pathway
17n/an/an/an/an/an/an/an/a
AstraZeneca R&D Montreal
Curated by ChEMBL
Assay Description
Displacement of [3H]-CP55,940 from human CB1 receptor expressed in HEK293 cells
Bioorg Med Chem Lett 22: 1619-24 (2012)
Article DOI: 10.1016/j.bmcl.2011.12.124
BindingDB Entry DOI: 10.7270/Q24J0FJX
Cannabinoid receptor 1
(Homo sapiens (Human))
BDBM50364935
(CHEMBL1950350)
Show SMILES CCS(=O)(=O)n1c2CCN(Cc2c2cc(ccc12)C(=O)N1CCC(C)CC1)C1CCCC1
Show InChI InChI=1S/C25H35N3O3S/c1-3-32(30,31)28-23-9-8-19(25(29)26-13-10-18(2)11-14-26)16-21(23)22-17-27(15-12-24(22)28)20-6-4-5-7-20/h8-9,16,18,20H,3-7,10-15,17H2,1-2H3
NCI pathway
Reactome pathway
n/an/an/an/a 11n/an/an/an/a
AstraZeneca R&D Montreal
Curated by ChEMBL
Assay Description
Agonist activity at human CB1 receptor expressed in HEK293 EBNA cells by [35S]GTPgamma binding assay
Bioorg Med Chem Lett 22: 1619-24 (2012)
Article DOI: 10.1016/j.bmcl.2011.12.124
BindingDB Entry DOI: 10.7270/Q24J0FJX