BDBM50364946 CHEMBL1950489
SMILES: CC1CCN(CC1)C(=O)c1ccc2n(C)c3CCN(Cc3c2c1)C1CCOCC1
InChI Key: InChIKey=IGBCISBWUNCTNY-UHFFFAOYSA-N
Data: 1 KI  1 IC50
Activity Spreadsheet -- Enzyme Inhibition Constant Data from BindingDB
Found 2 hits for monomerid = 50364946
Trg + Lig
Ki
nM
ΔG°
kcal/mole
IC50
nM
Kd
nM
EC50/IC50
nM
koff
s-1
kon
M-1s-1
pHTemp
°C
Cannabinoid receptor 1
(Homo sapiens (Human))
BDBM50364946
(CHEMBL1950489)
Show SMILES CC1CCN(CC1)C(=O)c1ccc2n(C)c3CCN(Cc3c2c1)C1CCOCC1
Show InChI InChI=1S/C24H33N3O2/c1-17-5-10-26(11-6-17)24(28)18-3-4-22-20(15-18)21-16-27(12-7-23(21)25(22)2)19-8-13-29-14-9-19/h3-4,15,17,19H,5-14,16H2,1-2H3
NCI pathway
Reactome pathway
76n/an/an/an/an/an/an/an/a
AstraZeneca R&D Montreal
Curated by ChEMBL
Assay Description
Displacement of [3H]-CP55,940 from human CB1 receptor expressed in HEK293 cells
Bioorg Med Chem Lett 22: 1619-24 (2012)
Article DOI: 10.1016/j.bmcl.2011.12.124
BindingDB Entry DOI: 10.7270/Q24J0FJX
Potassium voltage-gated channel subfamily H member 2
(Homo sapiens (Human))
BDBM50364946
(CHEMBL1950489)
Show SMILES CC1CCN(CC1)C(=O)c1ccc2n(C)c3CCN(Cc3c2c1)C1CCOCC1
Show InChI InChI=1S/C24H33N3O2/c1-17-5-10-26(11-6-17)24(28)18-3-4-22-20(15-18)21-16-27(12-7-23(21)25(22)2)19-8-13-29-14-9-19/h3-4,15,17,19H,5-14,16H2,1-2H3
Reactome pathway
n/an/a 2.60E+3n/an/an/an/an/an/a
AstraZeneca R&D Montreal
Curated by ChEMBL
Assay Description
Inhibition of human Erg by voltage ion flux electrophysiological assay
Bioorg Med Chem Lett 22: 1619-24 (2012)
Article DOI: 10.1016/j.bmcl.2011.12.124
BindingDB Entry DOI: 10.7270/Q24J0FJX