BDBM50365136 CHEMBL1949842
SMILES: Cc1cccc2nc[nH]c(=O)c12
InChI Key: InChIKey=PXDDCBOOHGDLBL-UHFFFAOYSA-N
Data: 1 IC50
Activity Spreadsheet -- Enzyme Inhibition Constant Data from BindingDB
Found 1 hit for monomerid = 50365136
Trg + Lig
Ki
nM
ΔG°
kcal/mole
IC50
nM
Kd
nM
EC50/IC50
nM
koff
s-1
kon
M-1s-1
pHTemp
°C
Poly [ADP-ribose] polymerase 1
(Homo sapiens (Human))
BDBM50365136
(CHEMBL1949842)
Show SMILES Cc1cccc2nc[nH]c(=O)c12
Show InChI InChI=1S/C9H8N2O/c1-6-3-2-4-7-8(6)9(12)11-5-10-7/h2-5H,1H3,(H,10,11,12)
n/an/a 2.50E+4n/an/an/an/an/an/a
St. John's University
Curated by ChEMBL
Assay Description
Inhibition of PARP1 using TACS-Sapphire substrate for 30 mins by colorimetry
Eur J Med Chem 50: 264-73 (2012)
Article DOI: 10.1016/j.ejmech.2012.02.001
BindingDB Entry DOI: 10.7270/Q2FT8MGP