null
SMILES: [O-][N+](=O)c1ccc2nc[nH]c(=O)c2c1
InChI Key: InChIKey=MOBNCKURXDGQCB-UHFFFAOYSA-N
Activity Spreadsheet -- Enzyme Inhibition Constant Data from BindingDB
Found 1 hit for monomerid = 50365142
Trg + Lig
Ki
nM
ΔG°
kcal/mole
IC50
nM
Kd
nM
EC50/IC50
nM
koff
s-1
kon
M-1s-1
pHTemp
°C
Poly [ADP-ribose] polymerase 1
(Homo sapiens (Human))
BDBM50365142
(CHEMBL1373905)
Show SMILES [O-][N+](=O)c1ccc2nc[nH]c(=O)c2c1
Show InChI InChI=1S/C8H5N3O3/c12-8-6-3-5(11(13)14)1-2-7(6)9-4-10-8/h1-4H,(H,9,10,12)
n/an/a 2.50E+4n/an/an/an/an/an/a
St. John's University
Curated by ChEMBL
Assay Description
Inhibition of PARP1 using TACS-Sapphire substrate for 30 mins by colorimetry
Eur J Med Chem 50: 264-73 (2012)
Article DOI: 10.1016/j.ejmech.2012.02.001
BindingDB Entry DOI: 10.7270/Q2FT8MGP